Tricyclo[3.3.1.02,8]nona-3,6-diene
- Formula: C9H10
- Molecular weight: 118.1757
- IUPAC Standard InChIKey: RHNDWILNXCGXLR-UHFFFAOYSA-N
- CAS Registry Number: 14693-11-9
- Chemical structure:
View 3d structure (requires JavaScript / HTML 5) - Permanent link for this species. Use this link for bookmarking this species for future reference.

Gas phase ion energetics data

Data compiled by: Sharon G. Lias, Rhoda D. Levin, and Sherif A. Kafafi
Ionization energy determinations
IE (eV) | Method | Reference | Comment |
---|---|---|---|
8.4 | PE | Askani, Gleiter, et al., 1971 | Vertical value |

References

Askani, Gleiter, et al., 1971
Askani, R.; Gleiter, R.; Heilbronner, E.; Hornung, V.; Musso, H.,
The orbital sequence in semibullvalene, barbaralene and dihydrobullvalene,
Tetrahedron Lett., 1971, 4461. [all data]