HOO anion

Vibrational and/or electronic energy levels

Data compiled by: Marilyn E. Jacox

State:   ?

 Energy
 (cm-1
 Med.   Transition   λmin
 (nm)
 λmax
 (nm)

Gas phase ion energetics data

Data compiled by: John E. Bartmess

Protonation reactions

HO2- + Hydrogen cation = Hydrogen peroxide

By formula: HO2- + H+ = H2O2

Quantity Value Units Method Reference Comment
Δr1575.3 ± 2.1kJ/molG+TSRamond, Blanksby, et al., 2002gas phase; versus HCCH
Δr1572. ± 8.8kJ/molG+TSBierbaum, Schmidt, et al., 1981gas phase; value altered from reference due to change in acidity scale
Quantity Value Units Method Reference Comment
Δr1546.0 ± 1.7kJ/molIMRERamond, Blanksby, et al., 2002gas phase; versus HCCH
Δr1542. ± 8.4kJ/molIMREBierbaum, Schmidt, et al., 1981gas phase; value altered from reference due to change in acidity scale

Reaction thermochemistry data

Data compiled by: John E. Bartmess

Individual Reactions

HO2- + Hydrogen cation = Hydrogen peroxide

By formula: HO2- + H+ = H2O2

Quantity Value Units Method Reference Comment
Δr376.50 ± 0.50kcal/molG+TSRamond, Blanksby, et al., 2002gas phase; versus HCCH
Δr375.6 ± 2.1kcal/molG+TSBierbaum, Schmidt, et al., 1981gas phase; value altered from reference due to change in acidity scale
Quantity Value Units Method Reference Comment
Δr369.50 ± 0.40kcal/molIMRERamond, Blanksby, et al., 2002gas phase; versus HCCH
Δr368.6 ± 2.0kcal/molIMREBierbaum, Schmidt, et al., 1981gas phase; value altered from reference due to change in acidity scale

References

Td = 8700 ± 50 gas Oakes, Harding, et al., 1985
Clifford, Wenthold, et al., 1998
Ramond, Blanksby, et al., 2002

State:   X

Vib.
sym.
 No.   Approximate
 type of mode
 cm-1   Med.   Method   References

a' 3 OO stretch 775 ± 250 gas PE Oakes, Harding, et al., 1985

Additional references: Jacox, 1994, page 51; Jacox, 2003, page 44

Oakes, Harding, et al., 1985
Oakes, J.M.; Harding, L.B.; Ellison, G.B., The photoelectron spectroscopy of HO2-, J. Chem. Phys., 1985, 83, 5400. [all data]

Clifford, Wenthold, et al., 1998
Clifford, E.P.; Wenthold, P.G.; Gareyev, R.; Lineberger, W.C.; DePuy, C.H.; Bierbaum, V.M.; Ellison, G.B., Photoelectron spectroscopy, gas phase acidity, and thermochemistry of tert-butyl hydroperoxide: Mechanisms for the rearrangement of peroxyl radicals, J. Chem. Phys., 1998, 109, 23, 10293, https://doi.org/10.1063/1.477725 . [all data]

Ramond, Blanksby, et al., 2002
Ramond, R.M.; Blanksby, S.J.; Kato, S.; Bierbaum, V.M.; Davico, G.E.; Schwartz, R.L.; Lineberger, W.C.; Ellison, G.B., Heat of Formation of the Hydroperoxyl Radical HOO Via Negative Ion Studies, J. Phys. Chem. A, 2002, 106, 42, 9641, https://doi.org/10.1021/jp014614h . [all data]

Jacox, 1994
Jacox, M.E., Vibrational and electronic energy levels of polyatomic transient molecules, American Chemical Society, Washington, DC, 1994, 464. [all data]

Jacox, 2003
Jacox, M.E., Vibrational and electronic energy levels of polyatomic transient molecules: supplement B, J. Phys. Chem. Ref. Data, 2003, 32, 1, 1-441, https://doi.org/10.1063/1.1497629 . [all data]