Trigermane
- Formula: Ge3H8
- Molecular weight: 225.98
- IUPAC Standard InChIKey: KHKRWLZKHOQQCV-UHFFFAOYSA-N
- CAS Registry Number: 14691-44-2
- Chemical structure:
View 3d structure (requires JavaScript / HTML 5) - Other names: Ge3H8

Phase change data

Antoine Equation Parameters
log10(P) = A − (B / (T + C))
P = vapor pressure (bar)
T = temperature (K)
View plot Requires a JavaScript / HTML 5 canvas capable browser.
Temperature (K) | A | B | C | Reference | Comment |
---|---|---|---|---|---|
236.3 to 384.0 | 4.26334 | 1556.602 | -18.376 | Stull, 1947 | Coefficents calculated by NIST from author's data. |

Gas phase ion energetics data

Data compiled as indicated in comments:
RDSH - Henry M. Rosenstock, Keith Draxl, Bruce W. Steiner, and John T. Herron
Ionization energy determinations
IE (eV) | Method | Reference | Comment |
---|---|---|---|
9.6 ± 0.3 | EI | Saalfeld and Svec, 1963 | RDSH |
Appearance energy determinations
Ion | AE (eV) | Other Products | Method | Reference | Comment |
---|---|---|---|---|---|
Ge+ | 16.3 ± 0.3 | ? | EI | Saalfeld and Svec, 1963 | RDSH |
Ge2+ | 15.8 ± 0.3 | ? | EI | Saalfeld and Svec, 1963 | RDSH |
Ge3+ | 14.6 ± 0.3 | ? | EI | Saalfeld and Svec, 1963 | RDSH |
Ge3H+ | 11.8 ± 0.3 | ? | EI | Saalfeld and Svec, 1963 | RDSH |
Ge3H2+ | 10.7 ± 0.3 | 3H2 | EI | Saalfeld and Svec, 1963 | RDSH |
Ge3H3+ | 10.6 ± 0.3 | 2H2+H | EI | Saalfeld and Svec, 1963 | RDSH |
Ge3H4+ | 10.4 ± 0.3 | 2H2 | EI | Saalfeld and Svec, 1963 | RDSH |
Ge3H5+ | 10.1 ± 0.3 | H2+H | EI | Saalfeld and Svec, 1963 | RDSH |
Ge3H6+ | 10.0 ± 0.3 | H2 | EI | Saalfeld and Svec, 1963 | RDSH |
Ge3H7+ | 9.9 ± 0.3 | H | EI | Saalfeld and Svec, 1963 | RDSH |

References

Stull, 1947
Stull, Daniel R.,
Vapor Pressure of Pure Substances. Organic and Inorganic Compounds,
Ind. Eng. Chem., 1947, 39, 4, 517-540, https://doi.org/10.1021/ie50448a022
. [all data]
Saalfeld and Svec, 1963
Saalfeld, F.E.; Svec, H.J.,
The mass spectra of volatile hydrides. II. Some higher hydrides of the group IVB and VB elements,
Inorg. Chem., 1963, 2, 50. [all data]