Acetamide, N,N-diethyl-2-methylthio-
- Formula: C7H15NOS
- Molecular weight: 161.265
- IUPAC Standard InChIKey: YKJQUQNAMFJFDZ-UHFFFAOYSA-N
- CAS Registry Number: 14680-21-8
- Chemical structure:
View 3d structure (requires JavaScript / HTML 5) - Permanent link for this species. Use this link for bookmarking this species for future reference.

Gas phase ion energetics data

Data compiled by: Sharon G. Lias and Joel F. Liebman
Ionization energy determinations
IE (eV) | Method | Reference | Comment |
---|---|---|---|
8.44 | PE | Jones, Modelli, et al., 1994 | Vertical value |

References

Jones, Modelli, et al., 1994
Jones, D.; Modelli, A.; Olivato, P.R.; DalColle, M.; dePalo, M.; Distefano, G.,
Ab initio and electron spectroscopy study of carbonyl derivatives,
J. Chem. Soc. Perkin Trans. 2, 1994, 1994, 1651. [all data]