Azulene,1,3-dibromo-
- Formula: C10H6Br2
- Molecular weight: 285.963
- IUPAC Standard InChIKey: OEXLRDNVSRMWHO-UHFFFAOYSA-N
- CAS Registry Number: 14658-95-8
- Chemical structure:
View 3d structure (requires JavaScript / HTML 5) - Permanent link for this species. Use this link for bookmarking this species for future reference.

Gas phase ion energetics data

Data compiled by: Sharon G. Lias, Rhoda D. Levin, and Sherif A. Kafafi
Ionization energy determinations
IE (eV) | Method | Reference | Comment |
---|---|---|---|
7.40 | PE | Dougherty, Lewis, et al., 1980 | Vertical value |

References

Dougherty, Lewis, et al., 1980
Dougherty, D.; Lewis, J.; Nauman, R.V.; McGlynn, S.P.,
Photoelectron spectroscopy of azulenes,
J. Electron Spectrosc. Relat. Phenom., 1980, 19, 21. [all data]