Cobalt, tetracarbonylsilyl-
- Formula: C4H3CoO4Si
- Molecular weight: 202.0829
- IUPAC Standard InChIKey: GNLQHEYIJVVRMJ-UHFFFAOYSA-N
- CAS Registry Number: 14652-62-1
- Chemical structure:
View 3d structure (requires JavaScript / HTML 5) - Other names: Tetracarbonylsilylcobalt

Phase change data

Data compiled by: William E. Acree, Jr., James S. Chickos
Enthalpy of vaporization
ΔvapH (kJ/mol) | Temperature (K) | Method | Reference | Comment |
---|---|---|---|---|
37.8 | 310. | T | Aylett and Campbell, 1969 | Based on data from 263. to 357. K. |

Gas phase ion energetics data

Data compiled by: Sharon G. Lias, Rhoda D. Levin, and Sherif A. Kafafi
Ionization energy determinations
IE (eV) | Method | Reference | Comment |
---|---|---|---|
8.85 ± 0.02 | PE | Cradock, Ebsworth, et al., 1973 | Vertical value |

References

Aylett and Campbell, 1969
Aylett, B.J.; Campbell, J.M.,
Silicon?transition-metal compounds. Part I. Silyltetracarbonylcobalt and related compounds,
J. Chem. Soc., A, 1969, 1910, https://doi.org/10.1039/j19690001910
. [all data]
Cradock, Ebsworth, et al., 1973
Cradock, S.; Ebsworth, E.A.V.; Robertson, A.,
Photoelectron spectra of some silyl and germyl transition-metal carbonyls and related specis,
J. Chem. Soc. Dalton Trans., 1973, 22. [all data]