Stannane, tetrabutyl-
- Formula: C16H36Sn
- Molecular weight: 347.167
- IUPAC Standard InChIKey: AFCAKJKUYFLYFK-UHFFFAOYSA-N
- CAS Registry Number: 1461-25-2
- Chemical structure:

Phase change data

Data compiled as indicated in comments:
MS - José A. Martinho Simões
AC - William E. Acree, Jr., James S. Chickos
Quantity | Value | Units | Method | Reference | Comment |
---|---|---|---|---|---|
ΔvapH° | 82.8 ± 2.1 | kJ/mol | CC-SB | Davies, Pope, et al., 1963 | MS |
Enthalpy of vaporization
ΔvapH (kJ/mol) | Temperature (K) | Reference | Comment |
---|---|---|---|
67.8 ± 0.5 | 425. | Baev, 2001 | Based on data from 389. to 462. K.; AC |
Antoine Equation Parameters
log10(P) = A − (B / (T + C))
P = vapor pressure (bar)
T = temperature (K)
View plot Requires a JavaScript / HTML 5 canvas capable browser.
Temperature (K) | A | B | C | Reference | Comment |
---|---|---|---|---|---|
373.8 to 573.8 | 4.95752 | 2882.044 | 6.532 | Umilin and Tsinovoi, 1968 | Coefficents calculated by NIST from author's data. |

Gas phase ion energetics data

Data compiled as indicated in comments:
LLK - Sharon G. Lias, Rhoda D. Levin, and Sherif A. Kafafi
Ionization energy determinations
IE (eV) | Method | Reference | Comment |
---|---|---|---|
8.76 | PE | Kochi, 1980 | Vertical value; LLK |
8.7 | PE | Schweig, Weidner, et al., 1973 | Vertical value; LLK |

Gas phase thermochemistry data

Data compiled by: José A. Martinho Simões
Quantity | Value | Units | Method | Reference | Comment |
---|---|---|---|---|---|
ΔfH°gas | -52.2 ± 1.8 | kcal/mol | Review | Martinho Simões | |
ΔfH°gas | -51.6 ± 1.0 | kcal/mol | Review | Martinho Simões | |
ΔfH°gas | -52.0 ± 1.1 | kcal/mol | Review | Martinho Simões | Selected data. Average of the values from Davies, Pope, et al., 1963 and Lautsch, Tröber, et al., 1963. |
ΔfH°gas | -36.8 ± 4.0 | kcal/mol | Review | Martinho Simões | |
ΔfH°gas | -79.76 | kcal/mol | Review | Martinho Simões |

Condensed phase thermochemistry data

Data compiled by: José A. Martinho Simões
Quantity | Value | Units | Method | Reference | Comment |
---|---|---|---|---|---|
ΔfH°liquid | -72.0 ± 1.7 | kcal/mol | Review | Martinho Simões | |
ΔfH°liquid | -71.44 ± 0.86 | kcal/mol | Review | Martinho Simões | |
ΔfH°liquid | -71.75 ± 0.96 | kcal/mol | Review | Martinho Simões | Selected data. Average of the values from Davies, Pope, et al., 1963 and Lautsch, Tröber, et al., 1963. |
ΔfH°liquid | -56.5 ± 4.0 | kcal/mol | Review | Martinho Simões | |
ΔfH°liquid | -99.55 | kcal/mol | Review | Martinho Simões | |
Quantity | Value | Units | Method | Reference | Comment |
ΔcH°liquid | -2800.5 ± 1.6 | kcal/mol | CC-SB | Davies, Pope, et al., 1963 | Please also see Pedley and Rylance, 1977 and Cox and Pilcher, 1970. |
ΔcH°liquid | -2801.10 ± 0.69 | kcal/mol | CC-SB | Lautsch, Tröber, et al., 1963 | Please also see Cox and Pilcher, 1970. |
ΔcH°liquid | -2816.0 ± 4.0 | kcal/mol | CC-SB | Dillard, McNeill, et al., 1958 | |
ΔcH°liquid | -2772.99 | kcal/mol | CC-SB | Jones, Evans, et al., 1935 |

Kovats' RI, non-polar column, isothermal

Column type | Active phase | Temperature (C) | I | Reference | Comment |
---|---|---|---|---|---|
Packed | Apiezon L | 190. | 1599. | Putnam and Pu, 1965 | Celite; Column length: 1. m |

Van Den Dool and Kratz RI, non-polar column, temperature ramp

Column type | Active phase | I | Reference | Comment |
---|---|---|---|---|
Packed | Apiezon L | 1588. | Putnam and Pu, 1965, 2 | Celite, 10. K/min; Column length: 3. m; Tstart: 60. C |
Packed | Apiezon L | 1594. | Putnam and Pu, 1965, 2 | Celite, 15. K/min; Column length: 3. m; Tstart: 60. C |
Packed | Apiezon L | 1593. | Putnam and Pu, 1965, 2 | Celite, 6. K/min; Column length: 3. m; Tstart: 60. C |

References

Davies, Pope, et al., 1963
Davies, J.V.; Pope, A.E.; Skinner, H.A.,
Thermochemistry of metallic alkyls. Part 10.?Heats of combustion of some tetra-alkyls of tin,
Trans. Faraday Soc., 1963, 59, 2233, https://doi.org/10.1039/tf9635902233
. [all data]
Baev, 2001
Baev, A.K.,
Izv. Vyssh. Uchebn. Zaved., Khim. Khim. Tekhnol., 2001, 44, 1, 3. [all data]
Umilin and Tsinovoi, 1968
Umilin, V.A.; Tsinovoi, Y.N.,
Vapor Pressure of Tetrabutyltin,
Zh. Fiz. Khim., 1968, 42, 2320-2322. [all data]
Kochi, 1980
Kochi, J.K.,
The role of electron transfer and charge transfer in organometallic chemistry,
Pure Appl. Chem., 1980, 52, 571. [all data]
Schweig, Weidner, et al., 1973
Schweig, A.; Weidner, U.; Manuel, G.,
Theory and application of photoelectron spectroscopy. XVI. Photoelectron spectroscopy and molecular conformations: Ge-C and Sn-C hyperconjugation and the conformation of allylgermanes and stannanes,
J. Organomet. Chem., 1973, 54, 145. [all data]