Silane,(phenylmethylene)bis[trimethyl
- Formula: C13H24Si2
- Molecular weight: 236.5007
- IUPAC Standard InChIKey: NISUIYZIODIZTR-UHFFFAOYSA-N
- CAS Registry Number: 14595-77-8
- Chemical structure:
View 3d structure (requires JavaScript / HTML 5) - Permanent link for this species. Use this link for bookmarking this species for future reference.

Gas phase ion energetics data

Data compiled as indicated in comments:
LLK - Sharon G. Lias, Rhoda D. Levin, and Sherif A. Kafafi
RDSH - Henry M. Rosenstock, Keith Draxl, Bruce W. Steiner, and John T. Herron
Ionization energy determinations
IE (eV) | Method | Reference | Comment |
---|---|---|---|
7.63 ± 0.04 | EI | Bock, Seidl, et al., 1968 | RDSH |
8.10 | PE | Bock, Kaim, et al., 1978 | Vertical value; LLK |
8.10 | PE | Bock, Kaim, et al., 1977 | Vertical value; LLK |

References

Bock, Seidl, et al., 1968
Bock, H.; Seidl, H.; Fochler, M.,
d-Orbitaleffekte in silicium-substituierten π-Elektronensystemen. X. Vertikale Ionisierungsenergien von Alkyl- und Silyl-benzolen,
Chem. Ber., 1968, 101, 2815. [all data]
Bock, Kaim, et al., 1978
Bock, H.; Kaim, W.; Rohwer, H.E.,
Die hyperkonjugative Stabilisierung von p-Xylol-Radikalkationen durch (H3C)3Si-Substituenten,
Chem. Ber., 1978, 111, 3573. [all data]
Bock, Kaim, et al., 1977
Bock, H.; Kaim, W.; Rohwer, H.E.,
Radical ions XI*. One-electron oxidation of alkylsilyl benzenes in the gas phase and in solution,
J. Organomet. Chem., 1977, 135, 14. [all data]