1,2,4-Tri-tert-butylbenzene
- Formula: C18H30
- Molecular weight: 246.4308
- IUPAC Standard InChIKey: IHZGECPPAQDWKL-UHFFFAOYSA-N
- CAS Registry Number: 1459-11-6
- Chemical structure:
View 3d structure (requires JavaScript / HTML 5) - Permanent link for this species. Use this link for bookmarking this species for future reference.

Condensed phase thermochemistry data

Data compiled by: Hussein Y. Afeefy, Joel F. Liebman, and Stephen E. Stein
Quantity | Value | Units | Method | Reference | Comment |
---|---|---|---|---|---|
ΔcH°solid | -11119. ± 3. | kJ/mol | Ccb | Kruerke, Hoogzand, et al., 1961 | Corresponding ΔfHºsolid = -251. kJ/mol (simple calculation by NIST; no Washburn corrections) |

Phase change data

Data compiled by: Thermodynamics Research Center, NIST Boulder Laboratories, Chris Muzny director
Quantity | Value | Units | Method | Reference | Comment |
---|---|---|---|---|---|
Tfus | 321.15 | K | N/A | Arnett, Sanda, et al., 1967 | Uncertainty assigned by TRC = 0.5 K |

Reaction thermochemistry data

Data compiled by: Hussein Y. Afeefy, Joel F. Liebman, and Stephen E. Stein
Individual Reactions
By formula: C18H30 = C18H30
Quantity | Value | Units | Method | Reference | Comment |
---|---|---|---|---|---|
ΔrH° | 93.3 ± 4.2 | kJ/mol | Eqk | Arnett, Sanda, et al., 1967, 2 | liquid phase; solvent: CS2 |

Gas phase ion energetics data

Data compiled as indicated in comments:
RDSH - Henry M. Rosenstock, Keith Draxl, Bruce W. Steiner, and John T. Herron
Ionization energy determinations
IE (eV) | Method | Reference | Comment |
---|---|---|---|
8.60 ± 0.07 | EI | Arnett, Sanda, et al., 1967 | RDSH |
Appearance energy determinations
Ion | AE (eV) | Other Products | Method | Reference | Comment |
---|---|---|---|---|---|
C17H27+ | 11.14 ± 0.07 | CH3 | EI | Arnett, Sanda, et al., 1967 | RDSH |

References

Kruerke, Hoogzand, et al., 1961
Kruerke, U.; Hoogzand, C.; Hubel, W.,
Uber organometall-komplexe, VI 1.2.4-tri-tert.-butyl-benzol,
Chem. Ber., 1961, 94, 2817-2820. [all data]
Arnett, Sanda, et al., 1967
Arnett, E.M.; Sanda, J.C.; Bollinger, J.M.; Barber, M.,
Crowded benzenes. VI. The strain energy in o-di-tbutylbenzenes,
J. Am. Chem. Soc., 1967, 89, 5389. [all data]
Arnett, Sanda, et al., 1967, 2
Arnett, E.M.; Sanda, J.C.; Bollinger, J.M.; Barber, M.,
Crowded benzenes. VI. The strain energy in o-di-t-butylbenzenes,
J. Am. Chem. Soc., 1967, 89, 5389-5400. [all data]
Dale, 1961
Dale, J.,
Chem. Ber., 1961, 94, 2821. [all data]