Phenyl 4-pyridyl ketone
- Formula: C12H9NO
- Molecular weight: 183.2060
- IUPAC Standard InChIKey: SKFLCXNDKRUHTA-UHFFFAOYSA-N
- CAS Registry Number: 14548-46-0
- Chemical structure:
View 3d structure (requires JavaScript / HTML 5) - Other names: Methanone, phenyl-4-pyridinyl-; Ketone, phenyl 4-pyridyl; γ-Benzoylpyridine; Ba 33215; 4-Benzoylpyridine; 4-Pyridyl phenyl ketone; Pyridine, 4-benzoyl-; Phenyl(4-pyridinyl)methanone; NSC 9488

Phase change data

Data compiled as indicated in comments:
BS - Robert L. Brown and Stephen E. Stein
TRC - Thermodynamics Research Center, NIST Boulder Laboratories, Chris Muzny director
Quantity | Value | Units | Method | Reference | Comment |
---|---|---|---|---|---|
Tboil | 588.2 | K | N/A | Aldrich Chemical Company Inc., 1990 | BS |
Tboil | 588. | K | N/A | Buckingham and Donaghy, 1982 | BS |
Quantity | Value | Units | Method | Reference | Comment |
Tfus | 348. | K | N/A | Kolev and Bleckmann, 1990 | Uncertainty assigned by TRC = 1.5 K; TRC |
Tfus | 344.6 to 345.6 | K | N/A | Buckingham and Donaghy, 1982 | BS |

Gas phase ion energetics data

Data compiled as indicated in comments:
LLK - Sharon G. Lias, Rhoda D. Levin, and Sherif A. Kafafi
Ionization energy determinations
IE (eV) | Method | Reference | Comment |
---|---|---|---|
9.6 ± 0.1 | EI | Grutzmacher and Schubert, 1979 | LLK |
Appearance energy determinations
Ion | AE (eV) | Other Products | Method | Reference | Comment |
---|---|---|---|---|---|
C7H5O+ | 10.8 ± 0.1 | C5H4N | EI | Grutzmacher and Schubert, 1979 | LLK |

References

Aldrich Chemical Company Inc., 1990
Aldrich Chemical Company Inc.,
Catalog Handbook of Fine Chemicals, Aldrich Chemical Company, Inc., Milwaukee WI, 1990, 1. [all data]
Buckingham and Donaghy, 1982
Buckingham, J.; Donaghy, S.M.,
Dictionary of Organic Compounds: Fifth Edition, Chapman and Hall, New York, 1982, 1. [all data]
Kolev and Bleckmann, 1990
Kolev, T.; Bleckmann, P.,
Vibrational spectra of 4-benzoylpyridine and the oxygen-18 substituted derivative,
Spectrosc. Lett., 1990, 23, 391-404. [all data]
Grutzmacher and Schubert, 1979
Grutzmacher, H.-F.; Schubert, R.,
Substituent effects in the mass spectra of benzoyl hetarenes,
Org. Mass Spectrom., 1979, 14, 567. [all data]