Manganese pentacarbonyl bromide
- Formula: C5BrMnO5
- Molecular weight: 274.893
- IUPAC Standard InChIKey: OESORJHGSXJTKX-UHFFFAOYSA-M
- CAS Registry Number: 14516-54-2
- Chemical structure:

Condensed phase thermochemistry data

Data compiled by: José A. Martinho Simões
Quantity | Value | Units | Method | Reference | Comment |
---|---|---|---|---|---|
ΔfH°solid | -970.6 ± 9.1 | kJ/mol | Review | Martinho Simões | |
ΔfH°solid | -963.8 ± 2.6 | kJ/mol | Review | Martinho Simões | Selected data |

Phase change data

Data compiled as indicated in comments:
AC - William E. Acree, Jr., James S. Chickos
MS - José A. Martinho Simões
Quantity | Value | Units | Method | Reference | Comment |
---|---|---|---|---|---|
ΔsubH° | 58.6 ± 8.4 | kJ/mol | N/A | Pilcher and Skinner, 1983 | See also Connor, Skinner, et al., 1972.; AC |
ΔsubH° | 88. ± 2. | kJ/mol | HAL-HFC | Connor, Zafarani-Moattar, et al., 1982 | MS |
ΔsubH° | 88.0 ± 2.0 | kJ/mol | C | Connor, Zafarani-Moattar, et al., 1982, 2 | AC |

Gas phase ion energetics data

Data compiled as indicated in comments:
LLK - Sharon G. Lias, Rhoda D. Levin, and Sherif A. Kafafi
RDSH - Henry M. Rosenstock, Keith Draxl, Bruce W. Steiner, and John T. Herron
Ionization energy determinations
IE (eV) | Method | Reference | Comment |
---|---|---|---|
8.97 ± 0.03 | EI | Junk, Svec, et al., 1968 | RDSH |
8.83 ± 0.05 | PE | Higginson, Lloyd, et al., 1975 | Vertical value; LLK |
8.86 | PE | Lichtenberger, Sarapu, et al., 1973 | Vertical value; LLK |
8.76 | PE | Evans, Green, et al., 1969 | Vertical value; RDSH |
Appearance energy determinations
Ion | AE (eV) | Other Products | Method | Reference | Comment |
---|---|---|---|---|---|
MnBr+ | 12.4 | 5CO | EI | Junk, Svec, et al., 1968 | RDSH |
COBrMn+ | 11.72 | 4CO | EI | Junk, Svec, et al., 1968 | RDSH |
MnCO+ | 15.13 | ? | EI | Junk, Svec, et al., 1968 | RDSH |
C2O2BrMn+ | 10.47 | 3CO | EI | Junk, Svec, et al., 1968 | RDSH |
C3O3BrMn+ | 9.55 | 2CO | EI | Junk, Svec, et al., 1968 | RDSH |
MnC3O3+ | 9.9 | ? | EI | Junk, Svec, et al., 1968 | RDSH |
Mn+ | 16.5 | ? | EI | Junk, Svec, et al., 1968 | RDSH |

Gas phase thermochemistry data

Data compiled by: José A. Martinho Simões
Quantity | Value | Units | Method | Reference | Comment |
---|---|---|---|---|---|
ΔfH°gas | -882.6 ± 9.3 | kJ/mol | Review | Martinho Simões | |
ΔfH°gas | -875.8 ± 3.3 | kJ/mol | Review | Martinho Simões | Selected data |

Reaction thermochemistry data

Data compiled by: José A. Martinho Simões
Individual Reactions
By formula: C5BrMnO5 (cr) + 0.5Br2 (g) = Br2Mn (cr) + 5CO (g)
Quantity | Value | Units | Method | Reference | Comment |
---|---|---|---|---|---|
ΔrH° | 9.9 ± 1.8 | kJ/mol | HAL-HFC | Connor, Zafarani-Moattar, et al., 1982 |

References

Martinho Simões
Martinho Simões, J.A.,
Private communication (see http://webbook.nist.gov/chemistry/om/). [all data]
Pilcher and Skinner, 1983
Pilcher, G.; Skinner, H.A.,
Thermochemistry of organometallic compounds, 1983, 43-90, https://doi.org/10.1002/9780470771686.ch2
. [all data]
Connor, Skinner, et al., 1972
Connor, J.A.; Skinner, H.A.; Virmani, Y.,
Microcalorimetric studies. Thermal decomposition and iodination of metal carbonyls,
J. Chem. Soc., Faraday Trans. 1, 1972, 68, 0, 1754, https://doi.org/10.1039/f19726801754
. [all data]
Connor, Zafarani-Moattar, et al., 1982
Connor, J.A.; Zafarani-Moattar, M.T.; Bickerton, J.; El-Saied, N.I.; Suradi, S.; Carson, R.; Al Takkhin, G.; Skinner, H.A.,
Organomet., 1982, 1, 1166. [all data]
Connor, Zafarani-Moattar, et al., 1982, 2
Connor, Joseph A.; Zafarani-Moattar, Mohamed T.; Bickerton, James; El Saied, Nabila I.; Suradi, Sukiman; Carson, Ronald; Al Takhin, Ghassan; Skinner, Henry A.,
Enthalpy of formation of acyl-, alkyl- and hydridopentacarbonyl-manganese complexes. The enthalpy contributions of manganese-hydrogen and manganese-carbon bonds in these molecules. Thermochemical aspects of models in Fischer-Tropsch reactions,
Organometallics, 1982, 1, 9, 1166-1174, https://doi.org/10.1021/om00069a011
. [all data]
Junk, Svec, et al., 1968
Junk, G.A.; Svec, H.J.; Angelici, R.J.,
Electron impact studies of manganese and rhenium pentacarbonyl halides,
J. Am. Chem. Soc., 1968, 90, 5758. [all data]
Higginson, Lloyd, et al., 1975
Higginson, B.R.; Lloyd, D.R.; Evans, S.; Orchard, A.F.,
Photoelectron studies of metal carbonyls. Part 5. - Substituted group VIIA carbonyls,
J. Chem. Soc. Faraday Trans. 2, 1975, 71, 1913. [all data]
Lichtenberger, Sarapu, et al., 1973
Lichtenberger, D.L.; Sarapu, A.C.; Fenske, R.F.,
Photoelectron spectra and electronic structure of pentacarbonylmanganese halides,
Inorg. Chem., 1973, 12, 702. [all data]
Evans, Green, et al., 1969
Evans, S.; Green, J.C.; Green, M.L.H.; Orchard, A.F.; Turner, D.W.,
Study of the bonding in pentacarbonylmanganese derivatives by photoelectron spectroscopy,
Faraday Discuss. Chem. Soc., 1969, 47, 112. [all data]