Disilane, hexamethyl-
- Formula: C6H18Si2
- Molecular weight: 146.3781
- IUPAC Standard InChIKey: NEXSMEBSBIABKL-UHFFFAOYSA-N
- CAS Registry Number: 1450-14-2
- Chemical structure:
View 3d structure (requires JavaScript / HTML 5) - Other names: Hexamethyldisilane; (CH3)6Si2; Permethyldisilane; CH7280

Condensed phase thermochemistry data

Data compiled by: Eugene S. Domalski and Elizabeth D. Hearing
Constant pressure heat capacity of liquid
Cp,liquid (J/mol*K) | Temperature (K) | Reference | Comment |
---|---|---|---|
255.89 | 295.67 | Suga and Seki, 1959 | T = 200 to 300 K. Value is unsmoothed experimental datum. |

Phase change data

Data compiled as indicated in comments:
BS - Robert L. Brown and Stephen E. Stein
TRC - Thermodynamics Research Center, NIST Boulder Laboratories, Chris Muzny director
AC - William E. Acree, Jr., James S. Chickos
CAL - James S. Chickos, William E. Acree, Jr., Joel F. Liebman, Students of Chem 202 (Introduction to the Literature of Chemistry), University of Missouri -- St. Louis
DH - Eugene S. Domalski and Elizabeth D. Hearing
Quantity | Value | Units | Method | Reference | Comment |
---|---|---|---|---|---|
Tboil | 386. | K | N/A | Farchan Laboratories, 1990 | BS |
Tboil | 386. | K | N/A | PCR Inc., 1990 | BS |
Quantity | Value | Units | Method | Reference | Comment |
Tfus | 287.1 | K | N/A | Takagi, Ishikawa, et al., 1986 | Uncertainty assigned by TRC = 0.1 K; TRC |
Tfus | 287.22 | K | N/A | Takagi, Ishikawa, et al., 1986 | Uncertainty assigned by TRC = 0.05 K; TRC |
Tfus | 287.7 | K | N/A | Suga and Seki, 1959, 2 | Crystal phase 1 phase; Uncertainty assigned by TRC = 0.2 K; TRC |
Enthalpy of vaporization
ΔvapH (kJ/mol) | Temperature (K) | Method | Reference | Comment |
---|---|---|---|---|
36.3 | 320. | EB | Takagi, Ishikawa, et al., 1986, 2 | Based on data from 305. to 387. K.; AC |
37.2 | 288. to 310. | N/A | Suga and Seki, 1959 | See also Takagi, Ishikawa, et al., 1986, 2.; AC |
36.8 | 294. to 334. | N/A | Brockway and Davidson, 1941 | See also Takagi, Ishikawa, et al., 1986, 2.; AC |
Enthalpy of fusion
ΔfusH (kJ/mol) | Temperature (K) | Reference | Comment |
---|---|---|---|
3.02 | 287.7 | Domalski and Hearing, 1996 | AC |
Entropy of fusion
ΔfusS (J/mol*K) | Temperature (K) | Reference | Comment |
---|---|---|---|
43.95 | 221.8 | Domalski and Hearing, 1996 | CAL |
10.49 | 287.7 |
Enthalpy of phase transition
ΔHtrs (kJ/mol) | Temperature (K) | Initial Phase | Final Phase | Reference | Comment |
---|---|---|---|---|---|
9.750 | 221.8 | crystaline, II | crystaline, I | Suga and Seki, 1959 | DH |
3.017 | 287.7 | crystaline, I | liquid | Suga and Seki, 1959 | DH |
Entropy of phase transition
ΔStrs (J/mol*K) | Temperature (K) | Initial Phase | Final Phase | Reference | Comment |
---|---|---|---|---|---|
43.96 | 221.8 | crystaline, II | crystaline, I | Suga and Seki, 1959 | DH |
10.49 | 287.7 | crystaline, I | liquid | Suga and Seki, 1959 | DH |

Gas phase ion energetics data

Data compiled as indicated in comments:
LBLHLM - Sharon G. Lias, John E. Bartmess, Joel F. Liebman, John L. Holmes, Rhoda D. Levin, and W. Gary Mallard
LLK - Sharon G. Lias, Rhoda D. Levin, and Sherif A. Kafafi
RDSH - Henry M. Rosenstock, Keith Draxl, Bruce W. Steiner, and John T. Herron
Ionization energy determinations
IE (eV) | Method | Reference | Comment |
---|---|---|---|
8.27 ± 0.05 | PIPECO | Szepes and Baer, 1984 | T = 298K; LBLHLM |
8.27 ± 0.05 | PIPECO | Szepes and Baer, 1984 | T = 0K; LBLHLM |
8.27 ± 0.05 | PIPECO | Szepes and Baer, 1984, 2 | T = 0K; LBLHLM |
8.4 | PE | Szepes, Koranyi, et al., 1981 | LLK |
8.0 | PE | Potzinger, Ritter, et al., 1975 | LLK |
8.35 ± 0.12 | EI | Lappert, Pedley, et al., 1971 | LLK |
8.46 ± 0.15 | EI | Gaidis, Briggs, et al., 1971 | LLK |
8.00 ± 0.01 | EI | Pitt, Bursey, et al., 1970 | RDSH |
8.35 ± 0.12 | EI | Lappert, Simpson, et al., 1969 | RDSH |
8.79 ± 0.08 | EI | Hess, Lampe, et al., 1965 | RDSH |
8.68 | PE | Mochida, Worley, et al., 1985 | Vertical value; LBLHLM |
8.7 ± 0.05 | PE | Szepes, Koranyi, et al., 1981 | Vertical value; LLK |
8.69 | PE | Khvostenko, Zykov, et al., 1981 | Vertical value; LLK |
8.69 | PE | Bock and Ensslin, 1971 | Vertical value; LLK |
Appearance energy determinations
Ion | AE (eV) | Other Products | Method | Reference | Comment |
---|---|---|---|---|---|
C3H9Si+ | 9.8 ± 0.1 | C3H9Si | PIPECO | Szepes and Baer, 1984 | T = 0K; LBLHLM |
C3H9Si+ | 9.9 | (CH3)3Si | EI | Potzinger, Ritter, et al., 1975 | LLK |
C3H9Si+ | 10.22 ± 0.18 | (CH3)3Si | EI | Lappert, Pedley, et al., 1971 | LLK |
C3H9Si+ | 10.22 ± 0.18 | ? | EI | Lappert, Simpson, et al., 1969 | RDSH |
C3H9Si+ | 10.0 ± 0.1 | ? | EI | Band, Davidson, et al., Commun. 1967 | RDSH |
C3H9Si+ | 10.0 ± 0.1 | ? | EI | Connor, Finney, et al., 1966 | RDSH |
C3H9Si+ | 10.69 ± 0.04 | ? | EI | Hess, Lampe, et al., 1964 | RDSH |
C5H15Si2+ | 9.6 ± 0.1 | CH3 | PIPECO | Szepes and Baer, 1984 | T = 0K; LBLHLM |
C5H15Si2+ | 9.6 ± 0.1 | CH3 | PIPECO | Szepes and Baer, 1984, 2 | T = 0K; LBLHLM |
C5H15Si2+ | 10.74 ± 0.08 | CH3 | EI | Hess, Lampe, et al., 1965 | RDSH |

Kovats' RI, non-polar column, isothermal

View large format table.

Column type Active phase Temperature (C) I Reference Comment
PackedC78, Branched paraffin130.686.1Dallos, Sisak, et al., 2000He; Column length: 3.3 m
PackedC78, Branched paraffin130.685.9Reddy, Dutoit, et al., 1992Chromosorb G HP; Column length: 3.3 m

Normal alkane RI, non-polar column, temperature ramp

View large format table.

Column type Active phase I Reference Comment
CapillarySqualane698.Szekely, Nefedov, et al., 1967Nitrogen, 5. K/min; Column length: 50. m; Column diameter: 0.25 mm; Tstart: 60. C; Tend: 250. C

Normal alkane RI, non-polar column, custom temperature program

View large format table.

Column type Active phase I Reference Comment
CapillarySqualane699.Szekely, Nefedov, et al., 1967Nitrogen; Column length: 50. m; Column diameter: 0.25 mm; Program: not specified

References

Suga and Seki, 1959
Suga, H.; Seki, S.,
On the phase transition of hexamethyldisilane,
Bull. Chem. Soc. Japan, 1959, 32, 1088-1093. [all data]
Farchan Laboratories, 1990
Farchan Laboratories,
Research Chemicals Catalog, Farchan Laboratories, Gainesville, FL, 1990, 91. [all data]
PCR Inc., 1990
PCR Inc.,
Research Chemicals Catalog 1990-1991, PCR Inc., Gainesville, FL, 1990, 1. [all data]
Takagi, Ishikawa, et al., 1986
Takagi, S.; Ishikawa, M.; Kumada, M.; Kimura, T.; Fujishiro, R.,
Vapor Pressure and Thermo. Prop. of Hexamethyldisilane at 305-387 K,
Thermochim. Acta, 1986, 109, 55. [all data]
Suga and Seki, 1959, 2
Suga, H.; Seki, S.,
On the phase transition of hexamethyldisilane,
Bull. Chem. Soc. Jpn., 1959, 32, 1088. [all data]
Takagi, Ishikawa, et al., 1986, 2
Takagi, Sadao; Ishikawa, Mitsuo; Kumada, Makoto; Kimura, Takayoshi; Fujishiro, Ryoichi,
Vapour pressure and thermodynamic properties of hexamethyldisilane at 305--387 K,
Thermochimica Acta, 1986, 109, 1, 55-61, https://doi.org/10.1016/0040-6031(86)85007-9
. [all data]
Brockway and Davidson, 1941
Brockway, L.O.; Davidson, N.R.,
The Molecular Structures of the Dimers of Aluminum Dimethyl Chloride, Aluminum Dimethyl Bromide, and Aluminum Trimethyl and of Hexamethyldisilane,
J. Am. Chem. Soc., 1941, 63, 12, 3287-3297, https://doi.org/10.1021/ja01857a018
. [all data]
Domalski and Hearing, 1996
Domalski, Eugene S.; Hearing, Elizabeth D.,
Heat Capacities and Entropies of Organic Compounds in the Condensed Phase. Volume III,
J. Phys. Chem. Ref. Data, 1996, 25, 1, 1, https://doi.org/10.1063/1.555985
. [all data]
Szepes and Baer, 1984
Szepes, L.; Baer, T.,
Dissociation dynamics of energy selected hexamethyldisilane ions and the heats of formation of (CH3)3Si+ and (CH3)3Si,
J. Am. Chem. Soc., 1984, 106, 273. [all data]
Szepes and Baer, 1984, 2
Szepes, L.; Baer, T.,
(CH3)3SiX tipusu vegyuletek vizsgalata fotoelectron-fotoion koincidenciaval,I. Meghatarozott belso energiaju hexametil-diszilan-ionok disszociaciojanak dinamikaja,
Magy. Kem. Foly., 1984, 90, 104. [all data]
Szepes, Koranyi, et al., 1981
Szepes, L.; Koranyi, T.; Naray-Szabo, G.; Modelli, A.; Distefano, G.,
Ultraviolet photoelectron spectra of group IV hexamethyl derivatives containing a metal-metal bond,
J. Organomet. Chem., 1981, 217, 35. [all data]
Potzinger, Ritter, et al., 1975
Potzinger, P.; Ritter, A.; Krause, J.,
Massenspektrometrische Bestimmung von Bindungsenergien in siliciumorganischen Verbindungen,
Z. Naturforsch. A:, 1975, 30, 347. [all data]
Lappert, Pedley, et al., 1971
Lappert, M.F.; Pedley, J.B.; Simpson, J.; Spalding, T.R.,
Bonding studies of compounds of boron and the Group IV elements. VI. Mass spectrometric studies on compounds Me4M and Me3M-M'Me3 (M and M'=C, Si, Ge, Sn, and Pb): thermochemical data,
J. Organomet. Chem., 1971, 29, 195. [all data]
Gaidis, Briggs, et al., 1971
Gaidis, J.M.; Briggs, P.R.; Shannon, T.W.,
Mass spectra of disilanes. Phenyl-silicon interaction and silicon-silicon bond strength,
J. Phys. Chem., 1971, 75, 974. [all data]
Pitt, Bursey, et al., 1970
Pitt, C.G.; Bursey, M.M.; Rogerson, P.F.,
Catenates of the group IV elements. Correlation of σ electron energies,
J. Am. Chem. Soc., 1970, 92, 519. [all data]
Lappert, Simpson, et al., 1969
Lappert, M.F.; Simpson, J.; Spalding, T.R.,
Bonding studies of compounds of the group IV elements: ionisation potentials of the Me3M radicals,
J.Organometal. Chem., 1969, 17, PI. [all data]
Hess, Lampe, et al., 1965
Hess, G.G.; Lampe, F.W.; Sommer, L.H.,
An electron impact study of ionization and dissociation of trimethylsilanes,
J. Am. Chem. Soc., 1965, 87, 5327. [all data]
Mochida, Worley, et al., 1985
Mochida, K.; Worley, S.; Kochi, J.,
UV photoelectron spectra of peralkylated catenates of Group 4B elements (silicon, germanium, and tin),
Bull. Chem. Soc. Jpn., 1985, 58, 3389. [all data]
Khvostenko, Zykov, et al., 1981
Khvostenko, V.I.; Zykov, B.G.; Yuriev, V.P.; Mironov, V.F.; Kovel'zon, G.I.; Panasenko, A.A.; Sheludyakov, V.D.; Gailyunas, I.A.,
Study of d(π)-p(π) interaction in vinyl- and alkylsilicon-containing compounds by photoelectron spectroscopy,
J. Organomet. Chem., 1981, 218, 155. [all data]
Bock and Ensslin, 1971
Bock, H.; Ensslin, W.,
Bond-bond interaction in polysilanes,
Angew. Chem. Int. Ed. Engl., 1971, 10, 404. [all data]
Band, Davidson, et al., Commun. 1967
Band, S.J.; Davidson, I.M.T.; Lambert, C.A.; Stephenson, I.L.,
Bond dissociation energies and heats of formation of trimethylsilyl compounds,
Chem., Commun. 1967, 723. [all data]
Connor, Finney, et al., 1966
Connor, J.A.; Finney, G.; Leigh, G.J.; Haszeldine, R.N.; Robinson, P.J.; Sedgwick, R.D.; Simmons, R.F.,
Bond dissociation energies in organosilicon compounds,
Chem. Commun., 1966, 178. [all data]
Hess, Lampe, et al., 1964
Hess, G.G.; Lampe, F.W.; Sommer, L.H.,
Bond dissociation energies and ion energetics in organosilicon compounds by electron impact,
J. Am. Chem. Soc., 1964, 86, 3174. [all data]