3-Cyclopentenyl radical
- Formula: C5H7
- Molecular weight: 67.1091
- IUPAC Standard InChIKey: DABYZUWMLUGAGP-UHFFFAOYSA-N
- CAS Registry Number: 14461-09-7
- Chemical structure:
View 3d structure (requires JavaScript / HTML 5) - Permanent link for this species. Use this link for bookmarking this species for future reference.

Gas phase ion energetics data

Data compiled by: Henry M. Rosenstock, Keith Draxl, Bruce W. Steiner, and John T. Herron
Ionization energy determinations
IE (eV) | Method | Reference |
---|---|---|
7.54 | EI | Pignataro, Cassuto, et al., 1967 |

References

Pignataro, Cassuto, et al., 1967
Pignataro, S.; Cassuto, A.; Lossing, F.P.,
Free radicals by mass spectrometry. XXXVI. Ionization potentials of conjugated and nonconjugated radicals,
J. Am. Chem. Soc., 1967, 89, 3693. [all data]