cerium tribromide
- Formula: Br3Ce
- Molecular weight: 379.828
- CAS Registry Number: 14457-87-5

Phase change data

Data compiled by: William E. Acree, Jr., James S. Chickos
Quantity | Value | Units | Method | Reference | Comment |
---|---|---|---|---|---|
ΔsubH° | 300. ± 10. | kJ/mol | TE | Villani, Brunetti, et al., 2000 | Based on data from 887. to 1003. K. |

Gas phase ion energetics data

Data compiled by: Sharon G. Lias, John E. Bartmess, Joel F. Liebman, John L. Holmes, Rhoda D. Levin, and W. Gary Mallard
Ionization energy determinations
IE (eV) | Method | Reference | Comment |
---|---|---|---|
9.5 | PE | Ruscic, Goodman, et al., 1983 | Vertical value |

References

Villani, Brunetti, et al., 2000
Villani, Anna Rita; Brunetti, Bruno; Piacente, Vincenzo,
Vapor Pressure and Enthalpies of Vaporization of Cerium Trichloride, Tribromide, and Triiodide,
J. Chem. Eng. Data, 2000, 45, 5, 823-828, https://doi.org/10.1021/je000035e
. [all data]
Ruscic, Goodman, et al., 1983
Ruscic, B.; Goodman, G.L.; Berkowitz, J.,
Photoelectron spectra of the lanthanide trihalides and their interpretation,
J. Chem. Phys., 1983, 78, 5443. [all data]