thulium tribromide
- Formula: Br3Tm
- Molecular weight: 408.646
- CAS Registry Number: 14456-51-0

Gas phase ion energetics data

Data compiled by: Sharon G. Lias, Rhoda D. Levin, and Sherif A. Kafafi
Ionization energy determinations
IE (eV) | Method | Reference |
---|---|---|
9.6 ± 0.7 | EI | Work and Eick, 1973 |
Appearance energy determinations
Ion | AE (eV) | Other Products | Method | Reference | Comment |
---|---|---|---|---|---|
Br2Tm+ | 11.1 ± 0.7 | Br | EI | Work and Eick, 1973 | |
Tm+ | 17.5 ± 0.7 | ? | EI | Work and Eick, 1973 |

References

Work and Eick, 1973
Work, D.E.; Eick, H.A.,
An investigation of the incongruent sublimation of some lanthanide (III) oxobromides,
High Temp. Sci., 1973, 5, 313. [all data]