cis-1,3,5-Trimethylpiperidine
- Formula: C8H17N
- Molecular weight: 127.2273
- IUPAC Standard InChIKey: IGJDIGJIINCEDE-OCAPTIKFSA-N
- CAS Registry Number: 14446-76-5
- Chemical structure:
View 3d structure (requires JavaScript / HTML 5) - Stereoisomers:

Gas phase ion energetics data

Data compiled as indicated in comments:
LBLHLM - Sharon G. Lias, John E. Bartmess, Joel F. Liebman, John L. Holmes, Rhoda D. Levin, and W. Gary Mallard
Ionization energy determinations
IE (eV) | Method | Reference | Comment |
---|---|---|---|
7.63 ± 0.05 | PE | Rozeboom and Houk, 1982 | LBLHLM |

References

Rozeboom and Houk, 1982
Rozeboom, M.D.; Houk, K.N.,
Stereospecific alkyl group effects on amine lone-pair ionization potentials: Photoelectron spectra of alkylpiperidines,
J. Am. Chem. Soc., 1982, 104, 1189. [all data]