Benzene, 1-(2-bromoethyl)-4-methoxy-
- Formula: C9H11BrO
- Molecular weight: 215.087
- IUPAC Standard InChIKey: OXHPTABOQVHKLN-UHFFFAOYSA-N
- CAS Registry Number: 14425-64-0
- Chemical structure:
View 3d structure (requires JavaScript / HTML 5) - Other names: Anisole, p-(2-bromoethyl)-; p-(2-Bromoethyl)anisole; p-Methoxyphenethyl bromide; p-Methoxyphenylethyl bromide; 4-Methoxyphenethyl bromide; 1-(2-Bromoethyl)-4-methoxybenzene; 1-Bromo-2-(4-methoxyphenyl)ethane

Gas phase ion energetics data

Data compiled by: Henry M. Rosenstock, Keith Draxl, Bruce W. Steiner, and John T. Herron
Ionization energy determinations
IE (eV) | Method | Reference |
---|---|---|
8.2 | EI | Grutzmacher, 1970 |
Appearance energy determinations
Ion | AE (eV) | Other Products | Method | Reference | Comment |
---|---|---|---|---|---|
C9H11O+ | 9.9 | Br | EI | Grutzmacher, 1970 |

References

Grutzmacher, 1970
Grutzmacher, H.-F.,
Zum Mechanismus massenspektrometrischer Fragmentierungsreaktionen-IV: zur Bildung von Phenonium-Ionen bei der Elektronenstoss-Fragmentierung von -Phenylathylbromiden,
Org. Mass Spectrom., 1970, 3, 131. [all data]