Iron, tris(1,3-diphenyl-1,3-propanedionato-O,O')-, (OC-6-11)-
- Formula: C45H33FeO6
- Molecular weight: 725.585
- IUPAC Standard InChIKey: JWPHPBLJVLHKOZ-VPWWGWCISA-K
- CAS Registry Number: 14405-49-3
- Chemical structure:

Phase change data

Data compiled by: William E. Acree, Jr., James S. Chickos
Quantity | Value | Units | Method | Reference | Comment |
---|---|---|---|---|---|
ΔsubH° | 49.7 ± 0.48 | kcal/mol | N/A | Bardi, Brunetti, et al., 1996 | |
ΔsubH° | 50. ± 1. | kcal/mol | N/A | Bardi, Brunetti, et al., 1996 | See also MacLaren and Gregory, 1955. |
Enthalpy of sublimation
ΔsubH (kcal/mol) | Temperature (K) | Method | Reference | Comment |
---|---|---|---|---|
47. ± 2. | 700. | TE | Bardi, Brunetti, et al., 1996 | Based on data from 680. to 720. K. See also Sime and Gregory, 1960. |
47.1 ± 0.5 | 817. | GS | Bardi, Brunetti, et al., 1996 | Based on data from 673. to 962. K. See also MacLaren and Gregory, 1955. |
47.1 ± 1. | 670. | ME | Bardi, Brunetti, et al., 1996 | Based on data from 623. to 718. K. See also MacLaren and Gregory, 1955. |

Gas phase ion energetics data

Data compiled by: Sharon G. Lias and Joel F. Liebman
Ionization energy determinations
IE (eV) | Method | Reference | Comment |
---|---|---|---|
9.7 | PE | Shcheka and Vovna, 1992 | Vertical value |

References

Bardi, Brunetti, et al., 1996
Bardi, Gianpiero; Brunetti, Bruno; Piacente, Vincenzo,
Vapor Pressure and Standard Enthalpies of Sublimation of Iron Difluoride, Iron Dichloride, and Iron Dibromide,
J. Chem. Eng. Data, 1996, 41, 1, 14-20, https://doi.org/10.1021/je950115w
. [all data]
MacLaren and Gregory, 1955
MacLaren, R.O.; Gregory, N.W.,
The Vapor Pressure of Iron(II) Bromide,
J. Phys. Chem., 1955, 59, 2, 184-186, https://doi.org/10.1021/j150524a022
. [all data]
Sime and Gregory, 1960
Sime, R.J.; Gregory, N.W.,
VAPOR PRESSURES OF FeCl 2 , FeBr 2 AND FeI 2 BY THE TORSION EFFUSION METHOD,
J. Phys. Chem., 1960, 64, 1, 86-89, https://doi.org/10.1021/j100830a021
. [all data]
Shcheka and Vovna, 1992
Shcheka, O.L.; Vovna, V.I.,
Electronic structure of some copper(II) and iron(III) -diketonates,
J. Electron Spectrosc. Relat. Phenom., 1992, 60, 211. [all data]