1,4-Pentadien-3-yl radical
- Formula: C5H7
- Molecular weight: 67.1091
- IUPAC Standard InChIKey: DVOOWDFPPNOBFV-UHFFFAOYSA-N
- CAS Registry Number: 14362-08-4
- Chemical structure:
View 3d structure (requires JavaScript / HTML 5) - Permanent link for this species. Use this link for bookmarking this species for future reference.

Gas phase ion energetics data

Data compiled as indicated in comments:
LLK - Sharon G. Lias, Rhoda D. Levin, and Sherif A. Kafafi
RDSH - Henry M. Rosenstock, Keith Draxl, Bruce W. Steiner, and John T. Herron
Ionization energy determinations
IE (eV) | Method | Reference | Comment |
---|---|---|---|
7.25 | EI | Lossing and Traeger, 1975 | LLK |
7.76 | EI | Pignataro, Cassuto, et al., 1967 | RDSH |

References

Lossing and Traeger, 1975
Lossing, F.P.; Traeger, J.C.,
Free radicals by mass spectrometry XLVI. Heats of formation of C5H7 and C5H9 radicals and cations.,
J. Am. Chem. Soc., 1975, 19, 9. [all data]
Pignataro, Cassuto, et al., 1967
Pignataro, S.; Cassuto, A.; Lossing, F.P.,
Free radicals by mass spectrometry. XXXVI. Ionization potentials of conjugated and nonconjugated radicals,
J. Am. Chem. Soc., 1967, 89, 3693. [all data]