Stannane, triethyl(triethylsilyl)-
- Formula: C12H30SiSn
- Molecular weight: 321.162
- IUPAC Standard InChIKey: NDZBYPKJWYIVBI-UHFFFAOYSA-N
- CAS Registry Number: 14355-67-0
- Chemical structure:
View 3d structure (requires JavaScript / HTML 5) - Permanent link for this species. Use this link for bookmarking this species for future reference.

Gas phase ion energetics data

Data compiled by: Sharon G. Lias, John E. Bartmess, Joel F. Liebman, John L. Holmes, Rhoda D. Levin, and W. Gary Mallard
Ionization energy determinations
IE (eV) | Method | Reference | Comment |
---|---|---|---|
8.10 | PE | Mochida, Worley, et al., 1985 | Vertical value |

References

Mochida, Worley, et al., 1985
Mochida, K.; Worley, S.; Kochi, J.,
UV photoelectron spectra of peralkylated catenates of Group 4B elements (silicon, germanium, and tin),
Bull. Chem. Soc. Jpn., 1985, 58, 3389. [all data]