Methylmercuric iodide
- Formula: CH3HgI
- Molecular weight: 342.53
- IUPAC Standard InChIKey: JVDIOYBHEYUIBM-UHFFFAOYSA-M
- CAS Registry Number: 143-36-2
- Chemical structure:
View 3d structure (requires JavaScript / HTML 5) - Other names: Mercury, iodomethyl-; Iodomethylmercury; Methyliodomercury; Methylmercury iodide; CH3HgI; Methylmercury(II) iodide

Gas phase thermochemistry data

Data compiled by: José A. Martinho Simões
Quantity | Value | Units | Method | Reference | Comment |
---|---|---|---|---|---|
ΔfH°gas | 21.6 ± 2.5 | kJ/mol | Review | Martinho Simões | The enthalpy of formation relies on 57.8 ± 3.0 kJ/mol for the enthalpy of formation of Hg(Me)2(l). |

Condensed phase thermochemistry data

Data compiled by: José A. Martinho Simões
Quantity | Value | Units | Method | Reference | Comment |
---|---|---|---|---|---|
ΔfH°solid | -43.7 ± 1.9 | kJ/mol | Review | Martinho Simões | The enthalpy of formation relies on 57.8 ± 3.0 kJ/mol for the enthalpy of formation of Hg(Me)2(l). |

Phase change data

Data compiled as indicated in comments:
MS - José A. Martinho Simões
AC - William E. Acree, Jr., James S. Chickos
Quantity | Value | Units | Method | Reference | Comment |
---|---|---|---|---|---|
ΔsubH° | 65.3 ± 1.7 | kJ/mol | RSC | Charnley and Skinner, 1951 | MS |
Enthalpy of sublimation
ΔsubH (kJ/mol) | Temperature (K) | Method | Reference | Comment |
---|---|---|---|---|
65.3 ± 1.6 | 276. | V | Charnley and Skinner, 1951, 2 | Based on data from 263. to 290. K.; AC |

Reaction thermochemistry data

Data compiled by: José A. Martinho Simões
Individual Reactions
By formula: C2H6Hg (l) + HgI2 (cr) = 2CH3HgI (cr)
Quantity | Value | Units | Method | Reference | Comment |
---|---|---|---|---|---|
ΔrH° | -39.8 ± 1.6 | kJ/mol | RSC | Hartley, Pritchard, et al., 1950 | Please also see Pedley and Rylance, 1977 and Cox and Pilcher, 1970. |

Gas phase ion energetics data

Data compiled as indicated in comments:
LLK - Sharon G. Lias, Rhoda D. Levin, and Sherif A. Kafafi
RDSH - Henry M. Rosenstock, Keith Draxl, Bruce W. Steiner, and John T. Herron
Ionization energy determinations
IE (eV) | Method | Reference | Comment |
---|---|---|---|
9.4 ± 0.2 | EI | Glockling, Irwin, et al., 1976 | LLK |
9.25 | PE | Eland, 1970 | Vertical value; RDSH |
Appearance energy determinations
Ion | AE (eV) | Other Products | Method | Reference | Comment |
---|---|---|---|---|---|
HgI+ | 12.2 ± 0.2 | CH3 | EI | Glockling, Irwin, et al., 1976 | LLK |

Vibrational and/or electronic energy levels

Data compiled by: Takehiko Shimanouchi
Symmetry: C3ν Symmetry Number σ = 3
Sym. | No | Approximate | Selected Freq. | Infrared | Raman | Comments | ||||
---|---|---|---|---|---|---|---|---|---|---|
Species | type of mode | Value | Rating | Value | Phase | Value | Phase | |||
a1 | 1 | CH3 s-str | 2920 | D | 2920 M | sln. | 2914 | sln. | ||
a1 | 2 | CH3 s-deform | 1180 | D | 1180 M | sln. | 1182 p | solid solid | ||
a1 | 3 | CHg str | 531 | D | 531 M | sln. | 538 p | solid solid | ||
a1 | 4 | HgI str | 184 | D | 184 M | sln. | 180 p | solid solid | ||
e | 5 | CH3 d-str | 3008 | D | 3008 M | sln. | ||||
e | 6 | CH3 d-deform | 1400 | D | 1400 W | sln. | ||||
e | 7 | CH3 rock | 781 | D | 781 S | sln. | ||||
e | 8 | CHgI bend | 64 | D | 64 M | sln. | ||||
Source: Shimanouchi, 1972

References

Martinho Simões
Martinho Simões, J.A.,
Private communication (see http://webbook.nist.gov/chemistry/om/). [all data]
Charnley and Skinner, 1951
Charnley, T.; Skinner, H.A.,
J. Chem. Soc., 1951, 1921.. [all data]
Charnley and Skinner, 1951, 2
Charnley, T.; Skinner, H.A.,
424. Measurements of the vapour pressures of some alkylmercury halides. The latent heats of sublimation of methyl- and ethyl- mercury halides,
J. Chem. Soc., 1951, 1921, https://doi.org/10.1039/jr9510001921
. [all data]
Hartley, Pritchard, et al., 1950
Hartley, K.; Pritchard, H.O.; Skinner, H.A.,
Thermochemistry of metallic alkyls. III.?mercury dimethyl and mercury methyl halides,
Trans. Faraday Soc., 1950, 46, 1019, https://doi.org/10.1039/tf9504601019
. [all data]
Pedley and Rylance, 1977
Pedley, J.B.; Rylance, J.,
Computer Analysed Thermochemical Data: Organic and Organometallic Compounds, University of Sussex, Brigton, 1977. [all data]
Cox and Pilcher, 1970
Cox, J.D.; Pilcher, G.,
Thermochemistry of Organic and Organometallic Compounds
in Academic Press, New York, 1970. [all data]
Glockling, Irwin, et al., 1976
Glockling, F.; Irwin, J.G.; Morrison, R.J.; Sweeney, J.J.,
A mass spectroscopic study of organomercurials and mercuric halides,
Inorg. Chim. Acta, 1976, 19, 267. [all data]
Eland, 1970
Eland, J.H.D.,
Photoelectron spectra and chemical bonding of mercury(II) compounds,
Intern. J. Mass Spectrom. Ion Phys., 1970, 4, 37. [all data]
Shimanouchi, 1972
Shimanouchi, T.,
Tables of Molecular Vibrational Frequencies Consolidated Volume II,
J. Phys. Chem. Ref. Data, 1972, 6, 3, 993-1102. [all data]