Phosphorus difluoride monochloride
- Formula: ClF2P
- Molecular weight: 104.424
- IUPAC Standard InChIKey: AENDXYYGTYFGOX-UHFFFAOYSA-N
- CAS Registry Number: 14335-40-1
- Chemical structure:
View 3d structure (requires JavaScript / HTML 5) - Permanent link for this species. Use this link for bookmarking this species for future reference.

Reaction thermochemistry data

Data compiled by: John E. Bartmess
Individual Reactions
+
= Cl2F2P-
By formula: Cl- + ClF2P = Cl2F2P-
Quantity | Value | Units | Method | Reference | Comment |
---|---|---|---|---|---|
ΔrH° | 98.99 | kJ/mol | N/A | Check, Lobring, et al., 2003 | gas phase |

Gas phase ion energetics data

Data compiled by: Sharon G. Lias, Rhoda D. Levin, and Sherif A. Kafafi
Ionization energy determinations
IE (eV) | Method | Reference | Comment |
---|---|---|---|
12.8 ± 0.1 | PE | Cradock and Rankin, 1972 | Vertical value |

Ion clustering data

Data compiled by: John E. Bartmess
Clustering reactions
+
= Cl2F2P-
By formula: Cl- + ClF2P = Cl2F2P-
Quantity | Value | Units | Method | Reference | Comment |
---|---|---|---|---|---|
ΔrH° | 98.99 | kJ/mol | N/A | Check, Lobring, et al., 2003 | gas phase |

References

Check, Lobring, et al., 2003
Check, C.E.; Lobring, K.C.; Keating, P.R.; Gilbert, T.M.; Sunderlin, L.S.,
Effect of substituents on the strength of hypervalent phosphorus-halogen bonds,
J. Phys. Chem. A, 2003, 107, 42, 8961-8967, https://doi.org/10.1021/jp030287x
. [all data]
Cradock and Rankin, 1972
Cradock, S.; Rankin, D.W.H.,
Photoelectron spectra of PF2H some substituted difluorophosphines,
J. Chem. Soc. Faraday Trans. 2, 1972, 68, 940. [all data]