[2H]hydrogen fluoride
- Formula: DF
- Molecular weight: 21.0125050
- IUPAC Standard InChIKey: KRHYYFGTRYWZRS-DYCDLGHISA-N
- CAS Registry Number: 14333-26-7
- Chemical structure:
View 3d structure (requires JavaScript / HTML 5) - Isotopologues:
- Other names: Hydrofluoric acid-d

Gas phase thermochemistry data

Quantity | Value | Units | Method | Reference | Comment |
---|---|---|---|---|---|
ΔfH°gas | -275.52 | kJ/mol | Review | Chase, 1998 | Data last reviewed in June, 1977 |
Quantity | Value | Units | Method | Reference | Comment |
S°gas,1 bar | 179.70 | J/mol*K | Review | Chase, 1998 | Data last reviewed in June, 1977 |
Gas Phase Heat Capacity (Shomate Equation)
Cp° = A + B*t + C*t2 + D*t3 +
E/t2
H° − H°298.15= A*t + B*t2/2 +
C*t3/3 + D*t4/4 − E/t + F − H
S° = A*ln(t) + B*t + C*t2/2 + D*t3/3 −
E/(2*t2) + G
Cp = heat capacity (J/mol*K)
H° = standard enthalpy (kJ/mol)
S° = standard entropy (J/mol*K)
t = temperature (K) / 1000.
View plot Requires a JavaScript / HTML 5 canvas capable browser.
Temperature (K) | 298. to 1600. | 1600. to 6000. |
---|---|---|
A | 29.70648 | 33.87492 |
B | -5.386272 | 2.000618 |
C | 10.59544 | -0.291975 |
D | -3.391237 | 0.018120 |
E | 0.017825 | -5.242678 |
F | -284.1614 | -294.2992 |
G | 216.9182 | 211.3899 |
H | -275.5164 | -275.5164 |
Reference | Chase, 1998 | Chase, 1998 |
Comment | Data last reviewed in June, 1977 | Data last reviewed in June, 1977 |

Gas phase ion energetics data

Data compiled as indicated in comments:
LLK - Sharon G. Lias, Rhoda D. Levin, and Sherif A. Kafafi
RDSH - Henry M. Rosenstock, Keith Draxl, Bruce W. Steiner, and John T. Herron
Ionization energy determinations
IE (eV) | Method | Reference | Comment |
---|---|---|---|
16.058 | TE | Guyon, Spohr, et al., 1976 | LLK |
16.058 ± 0.003 | PE | Walker, Dehmer, et al., 1973 | LLK |
16.030 ± 0.010 | PI | Berkowitz, Chupka, et al., 1971 | LLK |
16.05 ± 0.01 | PE | Brundle, 1970 | RDSH |
16.06 ± 0.01 | PE | Lempka and Price, 1968 | RDSH |
Appearance energy determinations
Ion | AE (eV) | Other Products | Method | Reference | Comment |
---|---|---|---|---|---|
D+ | 16.134 ± 0.005 | F- | PI | Berkowitz, Chupka, et al., 1971 | LLK |
D+ | 19.513 ± 0.005 | F | PI | Berkowitz, Chupka, et al., 1971 | LLK |

References

Chase, 1998
Chase, M.W., Jr.,
NIST-JANAF Themochemical Tables, Fourth Edition,
J. Phys. Chem. Ref. Data, Monograph 9, 1998, 1-1951. [all data]
Guyon, Spohr, et al., 1976
Guyon, P.-M.; Spohr, R.; Chupka, W.A.; Berkowitz, J.,
Threshold photoelectron spectra of HF, DF, F2,
J. Chem. Phys., 1976, 65, 1650. [all data]
Walker, Dehmer, et al., 1973
Walker, T.E.H.; Dehmer, P.M.; Berkowitz, J.,
Rotational band shapes in photoelectron spectroscopy: HF DF,
J. Chem. Phys., 1973, 59, 4292. [all data]
Berkowitz, Chupka, et al., 1971
Berkowitz, J.; Chupka, W.A.; Guyon, P.M.; Holloway, J.H.; Spohr, R.,
Photoionization mass spectrometric study of F2, HF, and DF,
J. Chem. Phys., 1971, 54, 5165. [all data]
Brundle, 1970
Brundle, C.R.,
Ionization and dissociation energies of HF and DF and their bearing on D(F2),
Chem. Phys. Lett., 1970, 7, 317. [all data]
Lempka and Price, 1968
Lempka, H.J.; Price, W.C.,
Ionization energies of HF and DF,
J. Chem. Phys., 1968, 48, 1875. [all data]