Thiourea, N-(1,1-dimethylethyl)-N'-phenyl-
- Formula: C11H16N2S
- Molecular weight: 208.323
- IUPAC Standard InChIKey: JHMCTNQTJNGVRX-UHFFFAOYSA-N
- CAS Registry Number: 14327-04-9
- Chemical structure:
View 3d structure (requires JavaScript / HTML 5) - Other names: Urea, 1-tert-butyl-3-phenyl-2-thio-

Gas phase ion energetics data

Data compiled by: Sharon G. Lias, Rhoda D. Levin, and Sherif A. Kafafi
Ionization energy determinations
IE (eV) | Method | Reference |
---|---|---|
7.85 ± 0.05 | EI | Baldwin, Loudon, et al., 1976 |

References

Baldwin, Loudon, et al., 1976
Baldwin, M.A.; Loudon, A.G.; Maccoll, A.; Webb, K.S.,
The nature and fragmentation pathways of the molecular ions of some arylureas, arylthioureas, acetanilides, thioacetanilides and related compounds,
Org. Mass Spectrom., 1976, 11, 1181. [all data]