cyclopent-3-en-1-one
- Formula: C5H6O
- Molecular weight: 82.1005
- IUPAC Standard InChIKey: KQAVUGAZLAPNJY-UHFFFAOYSA-N
- CAS Registry Number: 14320-37-7
- Chemical structure:
View 3d structure (requires JavaScript / HTML 5) - Other names: 3-Cyclopenten-1-one

Gas phase ion energetics data

Data compiled by: Sharon G. Lias, Rhoda D. Levin, and Sherif A. Kafafi
Ionization energy determinations
IE (eV) | Method | Reference | Comment |
---|---|---|---|
9.44 ± 0.02 | PE | Chadwick, Frost, et al., 1971 | Vertical value |

References

Chadwick, Frost, et al., 1971
Chadwick, D.; Frost, D.C.; Weiler, L.,
Photoelectron spectra of cyclopentanone and cyclopentenones,
J. Am. Chem. Soc., 1971, 93, 4320. [all data]