1,2:3,4-Dicycloheptenobenzene
- Formula: C16H22
- Molecular weight: 214.3459
- IUPAC Standard InChIKey: WJQQTTIQCZWNPU-UHFFFAOYSA-N
- CAS Registry Number: 14314-87-5
- Chemical structure:
View 3d structure (requires JavaScript / HTML 5) - Permanent link for this species. Use this link for bookmarking this species for future reference.

Gas phase ion energetics data

Data compiled by: Henry M. Rosenstock, Keith Draxl, Bruce W. Steiner, and John T. Herron
Ionization energy determinations
IE (eV) | Method | Reference |
---|---|---|
8.39 ± 0.02 | EI | Meier, Heiss, et al., 1968 |

References

Meier, Heiss, et al., 1968
Meier, H.; Heiss, J.; Suhr, H.; Muller, E.,
Energetische Untersuchungen zum Mills-Nixon-Effekt. Ionisierungsenergien von Benzolmolekulen mit ankondensierten gesattigten Ringen,
Tetrahedron, 1968, 24, 2307. [all data]