Water-18O
- Formula: H218O
- Molecular weight: 20.01504
- IUPAC Standard InChIKey: XLYOFNOQVPJJNP-NJFSPNSNSA-N
- CAS Registry Number: 14314-42-2
- Chemical structure:
View 3d structure (requires JavaScript / HTML 5) - Isotopologues:

Phase change data

Data compiled by: Thermodynamics Research Center, NIST Boulder Laboratories, Chris Muzny director
Quantity | Value | Units | Method | Reference | Comment |
---|---|---|---|---|---|
Tfus | 273.43 | K | N/A | Steckel and Szapiro, 1963 | Uncertainty assigned by TRC = 0.03 K; air saturation not well established |

Gas phase ion energetics data

Data compiled by: Sharon G. Lias, Rhoda D. Levin, and Sherif A. Kafafi
Ionization energy determinations
IE (eV) | Method | Reference |
---|---|---|
12.615 ± 0.001 | PE | Karlsson, Mattson, et al., 1975 |

References

Steckel and Szapiro, 1963
Steckel, F.; Szapiro, S.,
Physical Prop. of Heavy Oxygen Water Part 1. Density and Thermal Expansion,
Trans. Faraday Soc., 1963, 59, 331-43. [all data]
Karlsson, Mattson, et al., 1975
Karlsson, L.; Mattson, L.; Jadrny, R.; Albridge, R.G.; Pinchas, S.; Bergmark, T.; Siegbahn, K.,
Isotopic and vibronic coupling effects in the valence electron spectra of H216O, H218O, and D216O,
J. Chem. Phys., 1975, 62, 4745. [all data]