Acetic acid, nonyl ester
- Formula: C11H22O2
- Molecular weight: 186.2912
- IUPAC Standard InChIKey: GJQIMXVRFNLMTB-UHFFFAOYSA-N
- CAS Registry Number: 143-13-5
- Chemical structure:
View 3d structure (requires JavaScript / HTML 5) - Other names: n-Nonanyl acetate; n-Nonyl acetate; n-Nonyl ethanoate; Acetic acid n-nonyl ester; Nonanol acetate; Nonyl acetate; Pelargonyl acetate

Phase change data

Data compiled as indicated in comments:
TRC - Thermodynamics Research Center, NIST Boulder Laboratories, Chris Muzny director
AC - William E. Acree, Jr., James S. Chickos
Quantity | Value | Units | Method | Reference | Comment |
---|---|---|---|---|---|
Tboil | 497. | K | N/A | Zhdanov, Dorofeenko, et al., 1962 | Uncertainty assigned by TRC = 4. K; TRC |
Quantity | Value | Units | Method | Reference | Comment |
ΔvapH° | 66.2 ± 0.2 | kJ/mol | GS | Krasnykh, Verevkin, et al., 2006 | Based on data from 277. to 309. K.; AC |
ΔvapH° | 66.8 | kJ/mol | N/A | Defibaugh, Carrillo-Nava, et al., 1997 | AC |
ΔvapH° | 67. | kJ/mol | GC | Koutek, Hoskovec, et al., 1997 | Based on data from 313. to 358. K. See also Ova, Koultek, et al., 2000.; AC |

Van Den Dool and Kratz RI, polar column, custom temperature program

Data compiled by: NIST Mass Spectrometry Data Center, William E. Wallace, director

Column type CapillaryCapillaryCapillary
Active phase DB-WaxDB-WaxDB-Wax
Column length (m) 30.50.50.
Carrier gas HeHeHe
Substrate
Column diameter (mm) 0.250.320.32
Phase thickness (μm) 0.5
Program 40C(2min) => 2C/min => 100C => 10C/min => 230C (5min)50C => 2.5C/min => 150C => 1.5C/min => 210C50C => 2.5C/min => 150C => 1.5C/min => 210C
I 1587.1602.21602.2
ReferenceKlesk and Qian, 2003Yang, Chyau, et al., 1998Yang, Chyau, et al., 1998
Comment MSDC-RI MSDC-RI MSDC-RI

Normal alkane RI, non-polar column, temperature ramp

Data compiled by: NIST Mass Spectrometry Data Center, William E. Wallace, director

Column type CapillaryCapillaryCapillaryCapillaryCapillary
Active phase DB-5DB-1DB-5DB-1OV-101
Column length (m) 30.60.30.25.50.
Carrier gas Helium HeHeHe
Substrate
Column diameter (mm) 0.320.250.2490.250.22
Phase thickness (μm) 0.250.250.250.251.
Tstart (C) 35.70.60.50.100.
Tend (C) 200.230.300.290.220.
Heat rate (K/min) 2.2.3.4.1.
Initial hold (min)  2.  1.
Final hold (min)  20.5.
I 1284.1292.1311.1311.1291.
ReferencePattiram, Lasekan, et al., 2011Sawamura, Onishi, et al., 2006Bos, Koulman, et al., 2002Koulman, 1999Camciuc, Bessière, et al., 1998
Comment MSDC-RI MSDC-RI MSDC-RI MSDC-RI MSDC-RI
Column type CapillaryCapillaryCapillaryCapillaryCapillary
Active phase DB-5 MSOV-101OV-101OV-101OV-101
Column length (m) 30.50.50.50.50.
Carrier gas Helium   N2
Substrate
Column diameter (mm) 0.250.220.250.250.25
Phase thickness (μm)
Tstart (C) 50.80.80.80.80.
Tend (C) 250.200.200.200.200.
Heat rate (K/min) 4.2.2.2.2.
Initial hold (min)
Final hold (min)
I 1308.1292.1290.1292.1291.
ReferenceGomez and Ledbetter, 1994Egolf and Jurs, 1993Tamura, Yang, et al., 1993Tamura, Yang, et al., 1993Yang and Sugisawa, 1990
Comment MSDC-RI MSDC-RI MSDC-RI MSDC-RI MSDC-RI
Column type CapillaryCapillaryCapillary
Active phase OV-101OV-101OV-101
Column length (m) 50.50.50.
Carrier gas N2N2N2
Substrate
Column diameter (mm) 0.250.250.25
Phase thickness (μm)
Tstart (C) 80.80.80.
Tend (C) 200.200.200.
Heat rate (K/min) 2.2.2.
Initial hold (min)
Final hold (min)
I 1293.1293.1295.
ReferenceYang and Sugisawa, 1990Sugisawa, Yang, et al., 1989Sugisawa, Yang, et al., 1989
Comment MSDC-RI MSDC-RI MSDC-RI

References

Zhdanov, Dorofeenko, et al., 1962
Zhdanov, Yu.A.; Dorofeenko, G.N.; Korol'chenko, G.A.,
Catalytic Acetylation of Polyhydroxy Compounds in the Presence of Magnesium Perchlorate,
Dokl. Akad. Nauk SSSR, 1962, 144, 1050. [all data]
Krasnykh, Verevkin, et al., 2006
Krasnykh, Eugen L.; Verevkin, Sergey P.; Koutek, Bohumir; Doubsky, Jan,
Vapour pressures and enthalpies of vaporization of a series of the linear n-alkyl acetates,
The Journal of Chemical Thermodynamics, 2006, 38, 6, 717-723, https://doi.org/10.1016/j.jct.2005.08.003
. [all data]
Defibaugh, Carrillo-Nava, et al., 1997
Defibaugh, D.R.; Carrillo-Nava, E.; Hurly, J.J.; Moldover, M.R.; Schmidt, J.W.; Weber, L.A.,
Thermodynamic Properties of HFC-338mccq, CF 3 CF 2 CF 2 CH 2 F, 1,1,1,2,2,3,3,4-Octafluorobutane «8224»,
J. Chem. Eng. Data, 1997, 42, 3, 488-496, https://doi.org/10.1021/je9603133
. [all data]
Koutek, Hoskovec, et al., 1997
Koutek, Bohumír; Hoskovec, Michal; Vrkocová, Pavlína; Feltl, Ladislav,
Gas chromatographic determination of vapour pressures of pheromone-like compounds IV. Acetates, a reinvestigation,
Journal of Chromatography A, 1997, 759, 1-2, 93-109, https://doi.org/10.1016/S0021-9673(96)00775-3
. [all data]
Ova, Koultek, et al., 2000
Ova, P.V.; Koultek, B.; Hoskovec, M.,
Practice Oriented Results on Use and Production of Neem Ingredients and Pheromones VI, H. Kleeberg and C.P.W. Zebitz, ed(s)., Druck and Graphic, Giessen, 2000, 211-218. [all data]