Silane, isothiocyanato-
- Formula: CH3NSSi
- Molecular weight: 89.192
- IUPAC Standard InChIKey: WDQDMOPZMLEJKT-UHFFFAOYSA-N
- CAS Registry Number: 14311-54-7
- Chemical structure:
View 3d structure (requires JavaScript / HTML 5) - Permanent link for this species. Use this link for bookmarking this species for future reference.

Gas phase ion energetics data

Data compiled by: Sharon G. Lias, Rhoda D. Levin, and Sherif A. Kafafi
Ionization energy determinations
IE (eV) | Method | Reference | Comment |
---|---|---|---|
9.54 ± 0.02 | PE | Cradock, Ebsworth, et al., 1972 | Vertical value |

References

Cradock, Ebsworth, et al., 1972
Cradock, S.; Ebsworth, E.A.V.; Murdoch, J.D.,
Photoelectron spectra of some Group 4 pseudohalides and related compounds,
J. Chem. Soc. Faraday Trans. 2, 1972, 68, 86. [all data]