Benzene, 1-iodo-4-(2-phenylethyl)-
- Formula: C14H13I
- Molecular weight: 308.1575
- IUPAC Standard InChIKey: CTNREHGTRZZBQM-UHFFFAOYSA-N
- CAS Registry Number: 14310-25-9
- Chemical structure:
View 3d structure (requires JavaScript / HTML 5) - Other names: Bibenzyl, 4-iodo-; 1-Iodo-4-(2-phenylethyl)benzene; 1-(4-Iodophenyl)-2-phenylethane

Gas phase ion energetics data

Data compiled by: Henry M. Rosenstock, Keith Draxl, Bruce W. Steiner, and John T. Herron
Ionization energy determinations
IE (eV) | Method | Reference |
---|---|---|
8.7 ± 0.1 | EI | McLafferty, Wachs, et al., 1970 |
Appearance energy determinations
Ion | AE (eV) | Other Products | Method | Reference | Comment |
---|---|---|---|---|---|
C7H6I+ | 10.3 ± 0.2 | ? | EI | McLafferty, Wachs, et al., 1970 | |
C7H7+ | 10.6 ± 0.2 | ? | EI | McLafferty, Wachs, et al., 1970 |

References

McLafferty, Wachs, et al., 1970
McLafferty, F.W.; Wachs, T.; Lifshitz, C.; Innorta, G.; Irving, P.,
Substituent effects in unimolecular ion decompositions. XV. Mechanistic interpretations and the quasi-equilibrium theory,
J. Am. Chem. Soc., 1970, 92, 6867. [all data]