Benzene, 1-methoxy-4-(2-phenylethyl)-
- Formula: C15H16O
- Molecular weight: 212.2869
- IUPAC Standard InChIKey: AFPZIAQJQAQDAQ-UHFFFAOYSA-N
- CAS Registry Number: 14310-21-5
- Chemical structure:
View 3d structure (requires JavaScript / HTML 5) - Other names: Anisole, p-phenethyl-; 1-(4-Methoxyphenyl)-2-phenylethane

Gas phase ion energetics data

Data compiled by: Henry M. Rosenstock, Keith Draxl, Bruce W. Steiner, and John T. Herron
Ionization energy determinations
IE (eV) | Method | Reference |
---|---|---|
8. ± 10. | EI | McLafferty, Wachs, et al., 1970 |
Appearance energy determinations
Ion | AE (eV) | Other Products | Method | Reference | Comment |
---|---|---|---|---|---|
C7H7+ | ~15. | ? | EI | McLafferty, Wachs, et al., 1970 | |
C8H9O+ | 9.6 ± 0.2 | C7H7 | EI | McLafferty, Wachs, et al., 1970 |

References

McLafferty, Wachs, et al., 1970
McLafferty, F.W.; Wachs, T.; Lifshitz, C.; Innorta, G.; Irving, P.,
Substituent effects in unimolecular ion decompositions. XV. Mechanistic interpretations and the quasi-equilibrium theory,
J. Am. Chem. Soc., 1970, 92, 6867. [all data]