Benzene,1-methyl-4-(2-phenylethyl)-
- Formula: C15H16
- Molecular weight: 196.2875
- IUPAC Standard InChIKey: CVFXRTRMJYAVJB-UHFFFAOYSA-N
- CAS Registry Number: 14310-20-4
- Chemical structure:
View 3d structure (requires JavaScript / HTML 5) - Permanent link for this species. Use this link for bookmarking this species for future reference.

Gas phase ion energetics data

Data compiled by: Sharon G. Lias, Rhoda D. Levin, and Sherif A. Kafafi
Ionization energy determinations
IE (eV) | Method | Reference |
---|---|---|
8.58 ± 0.05 | EI | Kuck and Grutzmacher, 1979 |
Appearance energy determinations
Ion | AE (eV) | Other Products | Method | Reference | Comment |
---|---|---|---|---|---|
C7H7+ | 11.3 ± 0.4 | ? | EI | Kuck and Grutzmacher, 1979 | |
C8H8+ | 10.6 ± 0.5 | ? | EI | Kuck and Grutzmacher, 1979 | |
C8H9+ | 10.0 ± 0.1 | ? | EI | Kuck and Grutzmacher, 1979 |

Phase change data

Data compiled by: Thermodynamics Research Center, NIST Boulder Laboratories, Chris Muzny director

Quantity Value Units Method Reference Comment
Tboil559.KN/AMann, 1881Uncertainty assigned by TRC = 4. K
Quantity Value Units Method Reference Comment
Tfus300.KN/AMann, 1881Uncertainty assigned by TRC = 4. K

In addition to the Thermodynamics Research Center (TRC) data available from this site, much more physical and chemical property data is available from the following TRC products:

References

Kuck and Grutzmacher, 1979
Kuck, D.; Grutzmacher, H.-Fr.,
The activation energy of the skeletal isomerization in the radical cations of toluene and cycloheptatriene by mass spectrometry of their 2-phenylethyl derivatives,
Org. Mass Spectrom., 1979, 14, 86. [all data]