Cyclobutane, 1,2-bis(methylene)-
- Formula: C6H8
- Molecular weight: 80.1277
- IUPAC Standard InChIKey: QOFLWDYWJZBWHM-UHFFFAOYSA-N
- CAS Registry Number: 14296-80-1
- Chemical structure:
View 3d structure (requires JavaScript / HTML 5) - Other names: Cyclobutane, 1,2-dimethylene-; 1,2-Dimethylenecyclobutane; 1,2-bis(Methylene)cyclobutane

Gas phase thermochemistry data

Data compiled by: Hussein Y. Afeefy, Joel F. Liebman, and Stephen E. Stein
Quantity | Value | Units | Method | Reference | Comment |
---|---|---|---|---|---|
ΔfH°gas | 204. | kJ/mol | Chyd | Roth, Lennartz, et al., 1986 | Mixture cis and trans |

Phase change data

Data compiled as indicated in comments:
BS - Robert L. Brown and Stephen E. Stein
TRC - Thermodynamics Research Center, NIST Boulder Laboratories, Chris Muzny director
Quantity | Value | Units | Method | Reference | Comment |
---|---|---|---|---|---|
Tboil | 346. | K | N/A | Buckingham and Donaghy, 1982 | BS |
Tboil | 346. | K | N/A | Blomquist and Verdol, 1955 | Uncertainty assigned by TRC = 4. K; TRC |

Reaction thermochemistry data

Data compiled by: Hussein Y. Afeefy, Joel F. Liebman, and Stephen E. Stein
Individual Reactions
By formula: 2H2 + C6H8 = C6H12
Quantity | Value | Units | Method | Reference | Comment |
---|---|---|---|---|---|
ΔrH° | -244. ± 0.8 | kJ/mol | Chyd | Roth, Lennartz, et al., 1986 | liquid phase; solvent: Isooctane; Mixture cis and trans |

Gas phase ion energetics data

Data compiled as indicated in comments:
LL - Sharon G. Lias and Joel F. Liebman
LLK - Sharon G. Lias, Rhoda D. Levin, and Sherif A. Kafafi
Ionization energy determinations
IE (eV) | Method | Reference | Comment |
---|---|---|---|
8.66 | PE | Werstiuk, Clark, et al., 1990 | Vertical value; LL |
8.77 | PE | Scharf, Plum, et al., 1979 | Vertical value; LLK |
8.66 ± 0.03 | PE | Hemmersbach, Klessinger, et al., 1978 | Vertical value; LLK |

References

Roth, Lennartz, et al., 1986
Roth, W.E.; Lennartz, H.W.; Vogel, E.; Leiendecker, M.; Masaji, O.,
Heats of hydrogenation. 6. Resonance energy of fused [4n]annulenes,
Chem. Ber., 1986, 119, 837-843. [all data]
Buckingham and Donaghy, 1982
Buckingham, J.; Donaghy, S.M.,
Dictionary of Organic Compounds: Fifth Edition, Chapman and Hall, New York, 1982, 1. [all data]
Blomquist and Verdol, 1955
Blomquist, A.T.; Verdol, J.A.,
1,2-Dimethylenecyclobutane,
J. Am. Chem. Soc., 1955, 77, 1806. [all data]
Werstiuk, Clark, et al., 1990
Werstiuk, N.H.; Clark, K.B.; Leigh, W.J.,
Conformational analysis and structure elucidation of 2,3-dimethyl and 2,4-dimethyl-2,4-hexadienes by AM1 and He(I) ultraviolet photoelectron spectroscopy,
Can. J. Chem., 1990, 68, 2078. [all data]
Scharf, Plum, et al., 1979
Scharf, H.-D.; Plum, H.; Fleischhauer, J.; Schleker, W.,
Zur Diels-Alder-Reaktivitat s-cis- fixierter 1,3-Diene,
Chem. Ber., 1979, 112, 862. [all data]
Hemmersbach, Klessinger, et al., 1978
Hemmersbach, P.; Klessinger, M.; Bruckmann, P.,
Electronic structure of exo-dimethylenecycloalkanes,
J. Am. Chem. Soc., 1978, 100, 6344. [all data]