n-Butyl ether
- Formula: C8H18O
- Molecular weight: 130.2279
- IUPAC Standard InChIKey: DURPTKYDGMDSBL-UHFFFAOYSA-N
- CAS Registry Number: 142-96-1
- Chemical structure:
View 3d structure (requires JavaScript / HTML 5) - Other names: Butane, 1,1'-oxybis-; Butyl ether; n-Dibutyl ether; Di-n-butyl ether; Dibutyl ether; Dibutyl oxide; 1,1'-Oxybis(butane); (n-C4H9)2O; 1-Butoxybutane; Butyl oxide; Ether butylique; UN 1149; NSC 8459

Gas phase thermochemistry data

Data compiled by: Hussein Y. Afeefy, Joel F. Liebman, and Stephen E. Stein
Quantity | Value | Units | Method | Reference | Comment |
---|---|---|---|---|---|
ΔfH°gas | -334. ± 2. | kJ/mol | Ccb | Colomina, Pell, et al., 1965 | |
ΔfH°gas | -334. | kJ/mol | Ccb | Murrin and Goldhagen, 1957 |

Condensed phase thermochemistry data

Data compiled as indicated in comments:
ALS - Hussein Y. Afeefy, Joel F. Liebman, and Stephen E. Stein
DH - Eugene S. Domalski and Elizabeth D. Hearing
Quantity | Value | Units | Method | Reference | Comment |
---|---|---|---|---|---|
ΔfH°liquid | -378.0 ± 1.0 | kJ/mol | Ccb | Colomina, Pell, et al., 1965 | ALS |
ΔfH°liquid | -377.6 ± 2.8 | kJ/mol | Ccb | Murrin and Goldhagen, 1957 | ALS |
Quantity | Value | Units | Method | Reference | Comment |
ΔcH°liquid | -5342.63 ± 0.92 | kJ/mol | Ccb | Colomina, Pell, et al., 1965 | Corresponding ΔfHºliquid = -377.9 kJ/mol (simple calculation by NIST; no Washburn corrections); ALS |
ΔcH°liquid | -5343.1 ± 2.8 | kJ/mol | Ccb | Murrin and Goldhagen, 1957 | Corresponding ΔfHºliquid = -377.4 kJ/mol (simple calculation by NIST; no Washburn corrections); ALS |
ΔcH°liquid | -5343.4 ± 3.3 | kJ/mol | Ccb | Skuratov, Strepikheev, et al., 1957 | Reanalyzed by Cox and Pilcher, 1970, Original value = -5345. ± 3. kJ/mol; Combustion at 293 K; Corresponding ΔfHºliquid = -377.1 kJ/mol (simple calculation by NIST; no Washburn corrections); ALS |
Constant pressure heat capacity of liquid
Cp,liquid (J/mol*K) | Temperature (K) | Reference | Comment |
---|---|---|---|
278.16 | 298.15 | Cobos, Casanova, et al., 1987 | Average of two measurements.; DH |

Phase change data

Data compiled as indicated in comments:
BS - Robert L. Brown and Stephen E. Stein
TRC - Thermodynamics Research Center, NIST Boulder Laboratories, Chris Muzny director
AC - William E. Acree, Jr., James S. Chickos
ALS - Hussein Y. Afeefy, Joel F. Liebman, and Stephen E. Stein
Quantity | Value | Units | Method | Reference | Comment |
---|---|---|---|---|---|
Tboil | 415. ± 1. | K | AVG | N/A | Average of 8 values; Individual data points |
Quantity | Value | Units | Method | Reference | Comment |
Tfus | 175.25 | K | N/A | Timmermans, 1952 | Uncertainty assigned by TRC = 0.4 K; TRC |
Tfus | 177.78 | K | N/A | Dreisbach and Martin, 1949 | Uncertainty assigned by TRC = 0.05 K; TRC |
Quantity | Value | Units | Method | Reference | Comment |
Tc | 588.1 | K | N/A | Majer and Svoboda, 1985 | |
Tc | 584.1 | K | N/A | Toczylkin. L.S. and Young, 1980 | Uncertainty assigned by TRC = 0.58 K; TRC |
Quantity | Value | Units | Method | Reference | Comment |
Pc | 30.10 | bar | N/A | Toczylkin. L.S. and Young, 1980 | Uncertainty assigned by TRC = 0.3007 bar; Visual; TRC |
Quantity | Value | Units | Method | Reference | Comment |
ΔvapH° | 45. | kJ/mol | N/A | Majer and Svoboda, 1985 | |
ΔvapH° | 44.7 ± 0.1 | kJ/mol | C | Fuchs, Peacock, et al., 1982 | AC |
ΔvapH° | 44.99 | kJ/mol | C | Majer, Wagner, et al., 1980 | ALS |
ΔvapH° | 45.0 ± 0.1 | kJ/mol | C | Majer, Wagner, et al., 1980 | AC |
ΔvapH° | 44.4 | kJ/mol | N/A | Ambrose, Ellender, et al., 1976 | Based on data from 362. to 414. K.; AC |
Enthalpy of vaporization
ΔvapH (kJ/mol) | Temperature (K) | Method | Reference | Comment |
---|---|---|---|---|
36.49 | 413.5 | N/A | Majer and Svoboda, 1985 | |
40.9 | 354. | A | Stephenson and Malanowski, 1987 | Based on data from 339. to 415. K.; AC |
41.7 | 351. | A | Stephenson and Malanowski, 1987 | Based on data from 336. to 415. K.; AC |
36.4 | 413. | N/A | Ambrose, Ellender, et al., 1976 | Based on data from 362. to 414. K.; AC |
40.6 | 377. | EB | Cidlinský and Polák, 1969 | Based on data from 362. to 413. K.; AC |
39.4 | 413. | N/A | Nisel'son and Lapivus, 1965 | Based on data from 386. to 440. K.; AC |
46.9 | 293. | V | Skuratov, Strepikheev, et al., 1957 | Combustion at 293 K; ALS |
43.93 ± 0.42 | 414.3 | V | Mathews and Fehlandt, 1931 | Reanalyzed by Pedley, Naylor, et al., 1986, Original value = 36.9 kJ/mol; ALS |
Enthalpy of vaporization
ΔvapH =
A exp(-βTr) (1 − Tr)β
ΔvapH =
Enthalpy of vaporization (at saturation pressure)
(kJ/mol)
Tr = reduced temperature (T / Tc)
View plot Requires a JavaScript / HTML 5 canvas capable browser.
Temperature (K) | A (kJ/mol) | β | Tc (K) | Reference | Comment |
---|---|---|---|---|---|
298. to 358. | 64.53 | 0.2974 | 588.1 | Majer and Svoboda, 1985 |
Antoine Equation Parameters
log10(P) = A − (B / (T + C))
P = vapor pressure (bar)
T = temperature (K)
View plot Requires a JavaScript / HTML 5 canvas capable browser.
Temperature (K) | A | B | C | Reference |
---|---|---|---|---|
362.29 to 413.21 | 3.93018 | 1302.768 | -81.481 | Cidlinský and Polák, 1969 |

Reaction thermochemistry data

Data compiled by: Michael M. Meot-Ner (Mautner) and Sharon G. Lias
Individual Reactions
By formula: CH6N+ + C8H18O = (CH6N+ • C8H18O)
Bond type: Hydrogen bonds of the type NH+-O between organics
Quantity | Value | Units | Method | Reference | Comment |
---|---|---|---|---|---|
ΔrH° | 105. | kJ/mol | PHPMS | Meot-Ner, 1984 | gas phase |
ΔrH° | 105. | kJ/mol | PHPMS | Meot-Ner (Mautner), 1983 | gas phase |
Quantity | Value | Units | Method | Reference | Comment |
ΔrS° | 117. | J/mol*K | PHPMS | Meot-Ner, 1984 | gas phase |
ΔrS° | 117. | J/mol*K | PHPMS | Meot-Ner (Mautner), 1983 | gas phase |

Henry's Law data

Data compiled by: Rolf Sander
Henry's Law constant (water solution)
kH(T) = k°H exp(d(ln(kH))/d(1/T) ((1/T) - 1/(298.15 K)))
k°H = Henry's law constant for solubility in water at 298.15 K (mol/(kg*bar))
d(ln(kH))/d(1/T) = Temperature dependence constant (K)
k°H (mol/(kg*bar)) | d(ln(kH))/d(1/T) (K) | Method | Reference | Comment |
---|---|---|---|---|
0.17 | X | N/A | Value given here as quoted by missing citation. |

Gas phase ion energetics data

Data evaluated as indicated in comments:
HL - Edward P. Hunter and Sharon G. Lias
Data compiled as indicated in comments:
MM - Michael M. Meot-Ner (Mautner)
LLK - Sharon G. Lias, Rhoda D. Levin, and Sherif A. Kafafi
RDSH - Henry M. Rosenstock, Keith Draxl, Bruce W. Steiner, and John T. Herron
Quantity | Value | Units | Method | Reference | Comment |
---|---|---|---|---|---|
Proton affinity (review) | 845.7 | kJ/mol | N/A | Hunter and Lias, 1998 | HL |
Quantity | Value | Units | Method | Reference | Comment |
Gas basicity | 818.3 | kJ/mol | N/A | Hunter and Lias, 1998 | HL |
Gas basicity at 298K
Gas basicity (review) (kJ/mol) | Reference | Comment |
---|---|---|
815.5 ± 0.5 | Decouzon, Gal, et al., 1996 | T = 338K; MM |
815.5 ± 0.5 | Decouzon, Gal, et al., 1996 | T = 338K; MM |
816.5 | Decouzon, Gal, et al., 1996 | T = T(eff) = 430K; MM |
Ionization energy determinations
IE (eV) | Method | Reference | Comment |
---|---|---|---|
9.28 ± 0.05 | EI | Williams and Hamill, 1968 | RDSH |
9.44 | PE | Aue and Bowers, 1979 | Vertical value; LLK |
9.40 | PE | Benoit and Harrison, 1977 | Vertical value; LLK |
9.51 ± 0.015 | PE | Klessinger, Asmus, et al., 1975 | Vertical value; LLK |
Appearance energy determinations
Ion | AE (eV) | Other Products | Method | Reference | Comment |
---|---|---|---|---|---|
C4H9+ | 11.8 ± 0.1 | ? | EI | Williams and Hamill, 1968 | RDSH |
C4H9O+ | 13.0 ± 0.1 | C4H9 | EI | Williams and Hamill, 1968 | RDSH |

Ion clustering data

Data compiled by: Michael M. Meot-Ner (Mautner) and Sharon G. Lias
Clustering reactions
By formula: CH6N+ + C8H18O = (CH6N+ • C8H18O)
Bond type: Hydrogen bonds of the type NH+-O between organics
Quantity | Value | Units | Method | Reference | Comment |
---|---|---|---|---|---|
ΔrH° | 105. | kJ/mol | PHPMS | Meot-Ner, 1984 | gas phase |
ΔrH° | 105. | kJ/mol | PHPMS | Meot-Ner (Mautner), 1983 | gas phase |
Quantity | Value | Units | Method | Reference | Comment |
ΔrS° | 117. | J/mol*K | PHPMS | Meot-Ner, 1984 | gas phase |
ΔrS° | 117. | J/mol*K | PHPMS | Meot-Ner (Mautner), 1983 | gas phase |

Kovats' RI, non-polar column, isothermal

Column type | Active phase | Temperature (C) | I | Reference | Comment |
---|---|---|---|---|---|
Packed | PMS-1000 | 90. | 865. | Arutyunov, Kudryashov, et al., 2004 | N2, Chromaton N-AW-DMCS; Column length: 2. m |
Packed | C78, Branched paraffin | 130. | 854.4 | Dallos, Sisak, et al., 2000 | He; Column length: 3.3 m |
Capillary | HP-101 | 60. | 876.82 | Garay, 2000 | 50. m/0.2 mm/0.2 μm, H2 |
Packed | C78, Branched paraffin | 130. | 854.9 | Reddy, Dutoit, et al., 1992 | Chromosorb G HP; Column length: 3.3 m |
Packed | Apolane | 130. | 854. | Dutoit, 1991 | Column length: 3.7 m |
Packed | SE-30 | 150. | 875. | Tiess, 1984 | Ar, Gas Chrom Q (80-100 mesh); Column length: 3. m |
Packed | Apiezon L | 120. | 861. | Bogoslovsky, Anvaer, et al., 1978 | Celite 545 |
Packed | Apiezon L | 160. | 865. | Bogoslovsky, Anvaer, et al., 1978 | Celite 545 |
Packed | Apiezon L | 130. | 858. | Bogoslovsky, Anvaer, et al., 1978 | |
Packed | Apolane | 70. | 858.0 | Riedo, Fritz, et al., 1976 | He, Chromosorb; Column length: 2.4 m |
Packed | Apiezon M | 130. | 865. | Golovnya and Garbuzov, 1974 | N2, Chromosorb W; Column length: 2.1 m |
Packed | DC-200 | 100. | 875. | Rohrschneider, 1966 | Column length: 4. m |
Packed | Squalane | 100. | 857. | Rohrschneider, 1966 | Column length: 5. m |
Packed | Apiezon L | 100. | 859. | Rohrschneider, 1966 | Column length: 5. m |
Packed | Apiezon L | 130. | 858. | Wehrli and Kováts, 1959 | Celite; Column length: 2.25 m |
Packed | Apiezon L | 190. | 862. | Wehrli and Kováts, 1959 | Celite; Column length: 2.25 m |

Kovats' RI, polar column, isothermal

Column type | Active phase | Temperature (C) | I | Reference | Comment |
---|---|---|---|---|---|
Packed | Carbowax 20M | 75. | 976. | Goebel, 1982 | N2, Kieselgur (60-100 mesh); Column length: 2. m |
Packed | PEG-2000 | 120. | 977. | Anderson, Jurel, et al., 1973 | He, Celite 545 (44-60 mesh); Column length: 3. m |
Packed | PEG-2000 | 150. | 970. | Anderson, Jurel, et al., 1973 | He, Celite 545 (44-60 mesh); Column length: 3. m |
Packed | PEG-2000 | 152. | 976. | Anderson, Jurel, et al., 1973 | He, Celite 545 (44-60 mesh); Column length: 3. m |
Packed | PEG-2000 | 179. | 970. | Anderson, Jurel, et al., 1973 | He, Celite 545 (44-60 mesh); Column length: 3. m |
Packed | PEG-2000 | 180. | 967. | Anderson, Jurel, et al., 1973 | He, Celite 545 (44-60 mesh); Column length: 3. m |
Packed | PEG-2000 | 200. | 967. | Anderson, Jurel, et al., 1973 | He, Celite 545 (44-60 mesh); Column length: 3. m |
Packed | Carbowax 20M | 100. | 970. | Rohrschneider, 1966 | Column length: 2. m |

Van Den Dool and Kratz RI, non-polar column, temperature ramp

Column type | Active phase | I | Reference | Comment |
---|---|---|---|---|
Capillary | HP-5 | 888. | Insausti, Goñi, et al., 2005 | 50. m/0.32 mm/1.05 μm, He, 35. C @ 15. min, 8. K/min, 220. C @ 5. min |
Capillary | Petrocol DH | 880.2 | Censullo, Jones, et al., 2003 | 50. m/0.25 mm/0.5 μm, He, 35. C @ 10. min, 3. K/min, 200. C @ 10. min |

Van Den Dool and Kratz RI, non-polar column, custom temperature program

Column type | Active phase | I | Reference | Comment |
---|---|---|---|---|
Capillary | DB-1 | 876. | Peng, 2000 | 15. m/0.53 mm/1. μm, He; Program: 40C(3min) => 8C/min => 200(1min) => 5C/min => 300C(25min) |

Van Den Dool and Kratz RI, polar column, temperature ramp

Column type | Active phase | I | Reference | Comment |
---|---|---|---|---|
Capillary | DB-Wax | 974. | Peng, 2000 | 15. m/0.53 mm/1. μm, He, 40. C @ 3. min, 5. K/min, 220. C @ 30. min |
Capillary | HP-Wax | 968. | Peng, 2000 | 15. m/0.53 mm/1. μm, He, 40. C @ 3. min, 5. K/min, 220. C @ 30. min |

Normal alkane RI, non-polar column, temperature ramp

Column type | Active phase | I | Reference | Comment |
---|---|---|---|---|
Capillary | OV-101 | 872. | Zenkevich, Eliseenkov, et al., 2011 | 25. m/0.20 mm/0.25 μm, Nitrogen, 6. K/min; Tstart: 40. C; Tend: 220. C |
Capillary | OV-101 | 875. | Zenkevich, Eliseenkov, et al., 2011 | 25. m/0.20 mm/0.25 μm, Nitrogen, 6. K/min; Tstart: 40. C; Tend: 220. C |

Normal alkane RI, non-polar column, custom temperature program

Column type | Active phase | I | Reference | Comment |
---|---|---|---|---|
Capillary | SE-30 | 876. | Vinogradov, 2004 | Program: not specified |
Capillary | Methyl Silicone | 858. | N/A | Program: not specified |
Capillary | Methyl Silicone | 875. | Zenkevich, 1998 | Program: not specified |
Capillary | OV-1, SE-30, Methyl silicone, SP-2100, OV-101, DB-1, etc. | 873. | Waggott and Davies, 1984 | Hydrogen; Column length: 50. m; Column diameter: 0.32 mm; Program: not specified |

Normal alkane RI, polar column, custom temperature program

Column type | Active phase | I | Reference | Comment |
---|---|---|---|---|
Capillary | Carbowax 20M | 965. | Vinogradov, 2004 | Program: not specified |
Capillary | DB-Wax | 971. | Peng, Yang, et al., 1991 | Program: not specified |
Capillary | Carbowax 400, Carbowax 20M, Carbowax 1540, Carbowax 4000, Superox 06, PEG 20M, etc. | 976. | Waggott and Davies, 1984 | Hydrogen; Column length: 50. m; Column diameter: 0.32 mm; Program: not specified |

References

Colomina, Pell, et al., 1965
Colomina, M.; Pell, A.S.; Skinner, H.A.; Coleman, D.J.,
Heats of combustion of four dialkylethers,
Trans. Faraday Soc., 1965, 61, 2641. [all data]
Murrin and Goldhagen, 1957
Murrin, J.W.; Goldhagen, S.,
Determination of the C-O bond energy from the heats of combustion of four aliphatic ethers,
NAVORD Report No. 5491, U.S. Naval Powder Factory Res. & Dev. Dept., 1957, 1-14. [all data]
Skuratov, Strepikheev, et al., 1957
Skuratov, S.M.; Strepikheev, A.A.; Kozina, M.P.,
About the reaction activity of five and six-membered heterocyclic compounds,
Dokl. Akad. Nauk SSSR, 1957, 117, 452-454. [all data]
Cox and Pilcher, 1970
Cox, J.D.; Pilcher, G.,
Thermochemistry of Organic and Organometallic Compounds, Academic Press, New York, 1970, 1-636. [all data]
Cobos, Casanova, et al., 1987
Cobos, J.C.; Casanova, C.; Roux-Desgranges, G.; Grolier, J.-P.E.,
Excess properties of mixtures of some n-alkoxyethanols with organic solvents. II. VEm and CEp,m with di-n-butylether at 298.15 K,
J. Chem. Thermodynam., 1987, 19, 791-796. [all data]
Timmermans, 1952
Timmermans, J.,
Freezing points of organic compounds. VVI New determinations.,
Bull. Soc. Chim. Belg., 1952, 61, 393. [all data]
Dreisbach and Martin, 1949
Dreisbach, R.R.; Martin, R.A.,
Physical Data on Some Organic Compounds,
Ind. Eng. Chem., 1949, 41, 2875-8. [all data]
Majer and Svoboda, 1985
Majer, V.; Svoboda, V.,
Enthalpies of Vaporization of Organic Compounds: A Critical Review and Data Compilation, Blackwell Scientific Publications, Oxford, 1985, 300. [all data]
Toczylkin. L.S. and Young, 1980
Toczylkin. L.S.; Young, C.L.,
Gas-liquid critical temperatures of mixtures containing electron donors II. Ether mixtures,
J. Chem. Thermodyn., 1980, 12, 355-64. [all data]
Fuchs, Peacock, et al., 1982
Fuchs, Richard; Peacock, L. Alan; Stephenson, W. Kirk,
Enthalpies of interaction of polar and nonpolar molecules with aromatic solvents,
Can. J. Chem., 1982, 60, 15, 1953-1958, https://doi.org/10.1139/v82-273
. [all data]
Majer, Wagner, et al., 1980
Majer, V.; Wagner, Z.; Svoboda, V.; Cadek, V.,
Enthalpies of vaporization and cohesive energies for a group of aliphatic ethers,
J. Chem. Thermodyn., 1980, 12, 387-391. [all data]
Ambrose, Ellender, et al., 1976
Ambrose, D.; Ellender, J.H.; Sprake, C.H.S.; Townsend, R.,
Thermodynamic properties of organic oxygen compounds XLIII. Vapour pressures of some ethers,
The Journal of Chemical Thermodynamics, 1976, 8, 2, 165-178, https://doi.org/10.1016/0021-9614(76)90090-2
. [all data]
Stephenson and Malanowski, 1987
Stephenson, Richard M.; Malanowski, Stanislaw,
Handbook of the Thermodynamics of Organic Compounds, 1987, https://doi.org/10.1007/978-94-009-3173-2
. [all data]
Cidlinský and Polák, 1969
Cidlinský, J.; Polák, J.,
Saturated vapour pressures of some ethers,
Collect. Czech. Chem. Commun., 1969, 34, 4, 1317-1321, https://doi.org/10.1135/cccc19691317
. [all data]
Nisel'son and Lapivus, 1965
Nisel'son, L.A.; Lapivus, I.I.,
Russ. J. Phys. Chem., 1965, 39, 80. [all data]
Mathews and Fehlandt, 1931
Mathews, J.H.; Fehlandt, P.R.,
The heats of vaporization of some organic compounds,
J. Am. Chem. Soc., 1931, 53, 3212-32. [all data]
Pedley, Naylor, et al., 1986
Pedley, J.B.; Naylor, R.D.; Kirby, S.P.,
Thermochemical Data of Organic Compounds, Chapman and Hall, New York, 1986, 1-792. [all data]
Meot-Ner, 1984
Meot-Ner, (Mautner)M.,
The Ionic Hydrogen Bond and Ion Solvation. 1. -NH+ O-, -NH+ N- and -OH+ O- Bonds. Correlations with Proton Affinity. Deviations Due to Structural Effects,
J. Am. Chem. Soc., 1984, 106, 5, 1257, https://doi.org/10.1021/ja00317a015
. [all data]
Meot-Ner (Mautner), 1983
Meot-Ner (Mautner), M.,
The Ionic Hydrogen Bond. 3. Multiple and -CH+...O- Bonds. Complexes of Ammonium Ions with Polyethers and Crown Ethers,
J. Am. Chem. Soc., 1983, 105, 15, 4912, https://doi.org/10.1021/ja00353a012
. [all data]
Hunter and Lias, 1998
Hunter, E.P.; Lias, S.G.,
Evaluated Gas Phase Basicities and Proton Affinities of Molecules: An Update,
J. Phys. Chem. Ref. Data, 1998, 27, 3, 413-656, https://doi.org/10.1063/1.556018
. [all data]
Decouzon, Gal, et al., 1996
Decouzon, M.; Gal, J.E.; Herreros, M.; Marai, P.C.; Murrell, J.; Todd, J.F.J.,
On the Use of the Kinetic Method for the Determination of Proton Affinities by Fourier-Transfrom Ion Cyclotron Resonance Mass Spectrometry,
Rapid. Comm. Mass Spectrom., 1996, 10, 242. [all data]
Williams and Hamill, 1968
Williams, J.M.; Hamill, W.H.,
Ionization potentials of molecules and free radicals and appearance potentials by electron impact in the mass spectrometer,
J. Chem. Phys., 1968, 49, 4467. [all data]
Aue and Bowers, 1979
Aue, D.H.; Bowers, M.T.,
Chapter 9. Stabilities of positive ions from equilibrium gas phase basicity measurements
in Ions Chemistry,, ed. M.T. Bowers, 1979. [all data]
Benoit and Harrison, 1977
Benoit, F.M.; Harrison, A.G.,
Predictive value of proton affinity. Ionization energy correlations involving oxygenated molecules,
J. Am. Chem. Soc., 1977, 99, 3980. [all data]
Klessinger, Asmus, et al., 1975
Klessinger, M.; Asmus, P.; Kraatz, U.,
Photoelektronenspektren organischer verbindungen-VII,
Tetrahedron, 1975, 31, 517. [all data]
Arutyunov, Kudryashov, et al., 2004
Arutyunov, Y.I.; Kudryashov, S.Y.; Onuchak, L.A.,
Analysis of Mixtures Containing Unknown Components by Gas Chromatography: Determination of Molecular Mass,
J. Anal. Chem. USSR (Engl. Transl.), 2004, 59, 4, 358-365. [all data]
Dallos, Sisak, et al., 2000
Dallos, A.; Sisak, A.; Kulcsár, Z.; Kováts, E.,
Pair-wise interactions by gas chromatography VII. Interaction free enthalpies of solutes with secondary alcohol groups,
J. Chromatogr. A, 2000, 904, 2, 211-242, https://doi.org/10.1016/S0021-9673(00)00908-0
. [all data]
Garay, 2000
Garay, F.,
Application of a flow-tunable, serially coupled gas chromatographic capillary column system for the analysis of complex mixtures,
Chromatographia Sup., 2000, 51, 1, s108-s120, https://doi.org/10.1007/BF02492792
. [all data]
Reddy, Dutoit, et al., 1992
Reddy, K.S.; Dutoit, J.-Cl.; Kovats, E. sz.,
Pair-wise interactions by gas chromatography. I. Interaction free enthalpies of solutes with non-associated primary alcohol groups,
J. Chromatogr., 1992, 609, 1-2, 229-259, https://doi.org/10.1016/0021-9673(92)80167-S
. [all data]
Dutoit, 1991
Dutoit, J.,
Gas chromatographic retention behaviour of some solutes on structurally similar polar and non-polar stationary phases,
J. Chromatogr., 1991, 555, 1-2, 191-204, https://doi.org/10.1016/S0021-9673(01)87179-X
. [all data]
Tiess, 1984
Tiess, D.,
Gaschromatographische Retentionsindices von 125 leicht- bis mittelflüchtigen organischen Substanzen toxikologisch-analytischer Relevanz auf SE-30,
Wiss. Z. Wilhelm-Pieck-Univ. Rostock Math. Naturwiss. Reihe, 1984, 33, 6-9. [all data]
Bogoslovsky, Anvaer, et al., 1978
Bogoslovsky, Yu.N.; Anvaer, B.I.; Vigdergauz, M.S.,
Chromatographic constants in gas chromatography (in Russian), Standards Publ. House, Moscow, 1978, 192. [all data]
Riedo, Fritz, et al., 1976
Riedo, F.; Fritz, D.; Tarján, G.; Kováts, E.Sz.,
A tailor-made C87 hydrocarbon as a possible non-polar standard stationary phase for gas chromatography,
J. Chromatogr., 1976, 126, 63-83, https://doi.org/10.1016/S0021-9673(01)84063-2
. [all data]
Golovnya and Garbuzov, 1974
Golovnya, R.V.; Garbuzov, V.G.,
Effect of heteroatom in aliphatic sulfur- and oxygen-containing compounds on the values of the retention indices in gas chromatography,
Izv. Akad. Nauk SSSR Ser. Khim., 1974, 7, 1519-1521. [all data]
Rohrschneider, 1966
Rohrschneider, L.,
Eine methode zur charakterisierung von gaschromatographischen trennflüssigkeiten,
J. Chromatogr., 1966, 22, 6-22, https://doi.org/10.1016/S0021-9673(01)97064-5
. [all data]
Wehrli and Kováts, 1959
Wehrli, A.; Kováts, E.,
Gas-chromatographische Charakterisierung ogranischer Verbindungen. Teil 3: Berechnung der Retentionsindices aliphatischer, alicyclischer und aromatischer Verbindungen,
Helv. Chim. Acta, 1959, 7, 7, 2709-2736, https://doi.org/10.1002/hlca.19590420745
. [all data]
Goebel, 1982
Goebel, K.-J.,
Gaschromatographische Identifizierung Niedrig Siedender Substanzen Mittels Retentionsindices und Rechnerhilfe,
J. Chromatogr., 1982, 235, 1, 119-127, https://doi.org/10.1016/S0021-9673(00)95793-5
. [all data]
Anderson, Jurel, et al., 1973
Anderson, A.; Jurel, S.; Shymanska, M.; Golender, L.,
Gas-liquid chromatography of some aliphatic and heterocyclic mono- and pollyfunctional amines. VII. Retention indices of amines in some polar and unpolar stationary phases,
Latv. PSR Zinat. Akad. Vestis Kim. Ser., 1973, 1, 51-63. [all data]
Insausti, Goñi, et al., 2005
Insausti, K.; Goñi, V.; Petri, E.; Gorraiz, C.; Beriain, M.J.,
Effect of weight at slaughter on the volatile compounds of cooked beef from Spanish cattle breeds,
Meat Sci., 2005, 70, 1, 83-90, https://doi.org/10.1016/j.meatsci.2004.12.003
. [all data]
Censullo, Jones, et al., 2003
Censullo, A.C.; Jones, D.R.; Wills, M.T.,
Speciation of the volatile organic compounds (VOCs) in solventborne aerosol coatings by solid phase microextraction-gas chromatography,
J. Coat. Technol., 2003, 75, 936, 47-53, https://doi.org/10.1007/BF02697922
. [all data]
Peng, 2000
Peng, C.T.,
Prediction of retention indices. V. Influence of electronic effects and column polarity on retention index,
J. Chromatogr. A, 2000, 903, 1-2, 117-143, https://doi.org/10.1016/S0021-9673(00)00901-8
. [all data]
Zenkevich, Eliseenkov, et al., 2011
Zenkevich, I.G.; Eliseenkov, E.V.; Kasatochkin, A.N.; Ukolov, A.I.,
Identification of the products of nonregioselective organic reactions by chromatography - mass spectrometry: chloro derivatives of dialkyl ethers,
Rus. J. Anal. Chem., 2011, 66, 14, 1445-1454, https://doi.org/10.1134/S1061934811140218
. [all data]
Vinogradov, 2004
Vinogradov, B.A.,
Production, composition, properties and application of essential oils, 2004, retrieved from http://viness.narod.ru. [all data]
Zenkevich, 1998
Zenkevich, I.G.,
Reciprocally Unambiguous Conformity Between GC Retention Indices and Boiling Points within Two- and Multidimensional Taxonomic Groups of Organic Compounds,
J. Hi. Res. Chromatogr., 1998, 21, 10, 565-568, https://doi.org/10.1002/(SICI)1521-4168(19981001)21:10<565::AID-JHRC565>3.0.CO;2-6
. [all data]
Waggott and Davies, 1984
Waggott, A.; Davies, I.W.,
Identification of organic pollutants using linear temperature programmed retention indices (LTPRIs) - Part II, 1984, retrieved from http://dwi.defra.gov.uk/research/completed-research/reports/dwi0383.pdf. [all data]
Peng, Yang, et al., 1991
Peng, C.T.; Yang, Z.C.; Ding, S.F.,
Prediction of rentention idexes. II. Structure-retention index relationship on polar columns,
J. Chromatogr., 1991, 586, 1, 85-112, https://doi.org/10.1016/0021-9673(91)80028-F
. [all data]