2,3-Diazabicyclo[2.2.2]oct-5-ene,2,3-dimethyl-
- Formula: C8H14N2
- Molecular weight: 138.2102
- IUPAC Standard InChIKey: QQHOVMMFCIDIDR-UHFFFAOYSA-N
- CAS Registry Number: 14287-91-3
- Chemical structure:
View 3d structure (requires JavaScript / HTML 5) - Permanent link for this species. Use this link for bookmarking this species for future reference.

Gas phase ion energetics data

Data compiled by: Sharon G. Lias, Rhoda D. Levin, and Sherif A. Kafafi
Ionization energy determinations
IE (eV) | Method | Reference | Comment |
---|---|---|---|
7.51 | PE | Rademacher and Koopman, 1975 | Vertical value |
7.51 | PE | Rademacher, 1974 | Vertical value |
7.49 | PE | Nelsen and Buschek, 1974 | Vertical value |
7.59 | PE | Nelsen and Buschek, 1973 | Vertical value |

References

Rademacher and Koopman, 1975
Rademacher, P.; Koopman, H.,
Cyclische und bicyclische Hydrazine,
Chem. Ber., 1975, 108, 1557. [all data]
Rademacher, 1974
Rademacher, P.,
Photoelectron spectra and conformation of cyclic N,N'-dimethylhydrazines,
Tetrahedron Lett., 1974, 83. [all data]
Nelsen and Buschek, 1974
Nelsen, S.F.; Buschek, J.M.,
Photoelectron spectra of hydrazines. V. Pyrazolidine and hexahydropyridazine derivatives,
J. Am. Chem. Soc., 1974, 96, 6987. [all data]
Nelsen and Buschek, 1973
Nelsen, S.F.; Buschek, J.M.,
Photoelectron spectra of hydrazines. I. Dependence of the lone pair-lone pair splitting on dihedral angle for tetraalkylhydrazines,
J. Am. Chem. Soc., 1973, 95, 2011. [all data]