2,3-methylbutanoic acid
- Formula: C6H12O2
- Molecular weight: 116.1583
- IUPAC Standard InChIKey: XFOASZQZPWEJAA-UHFFFAOYSA-N
- CAS Registry Number: 14287-61-7
- Chemical structure:
View 3d structure (requires JavaScript / HTML 5) - Other names: 2,3-dimethylbutyric acid

Phase change data

Data compiled by: Thermodynamics Research Center, NIST Boulder Laboratories, Chris Muzny director
Quantity | Value | Units | Method | Reference | Comment |
---|---|---|---|---|---|
Tfus | 271.6 | K | N/A | Timmermans, 1952 | Uncertainty assigned by TRC = 0.8 K |

Gas phase ion energetics data

Data compiled by: Sharon G. Lias, Rhoda D. Levin, and Sherif A. Kafafi
Appearance energy determinations
Ion | AE (eV) | Other Products | Method | Reference | Comment |
---|---|---|---|---|---|
C3H6O2+ | 10.20 | C3H6 | EI | Holmes and Lossing, 1980 |

Van Den Dool and Kratz RI, non-polar column, custom temperature program

Column type | Active phase | I | Reference | Comment |
---|---|---|---|---|
Capillary | DB-1 | 874. | Rouseff, Smoot, et al., 2002 | Program: not specified |

References

Timmermans, 1952
Timmermans, J.,
Freezing points of organic compounds. VVI New determinations.,
Bull. Soc. Chim. Belg., 1952, 61, 393. [all data]
Holmes and Lossing, 1980
Holmes, J.L.; Lossing, F.P.,
Gas-phase heats of formation of keto and enol ions of carbonyl compounds.,
J. Am. Chem. Soc., 1980, 102, 1591. [all data]