Dirhenium decacarbonyl
- Formula: C10O10Re2
- Molecular weight: 652.515
- IUPAC Standard InChIKey: ZIZHEHXAMPQGEK-UHFFFAOYSA-N
- CAS Registry Number: 14285-68-8
- Chemical structure:
View 3d structure (requires JavaScript / HTML 5) - Other names: Re2(CO)10; Rhenium carbonyl; Rhenium, decacarbonyldi-,; Decacarbonyldirhenium; Rhenium carbonyl (Re2(CO)10); Rhenium, decacarbonyldi-, (Re-Re)

Gas phase thermochemistry data

Data compiled by: José A. Martinho Simões
Quantity | Value | Units | Method | Reference | Comment |
---|---|---|---|---|---|
ΔfH°gas | -1557.1 ± 9.1 | kJ/mol | Review | Martinho Simões | |
ΔfH°gas | -1544.1 ± 6.4 | kJ/mol | Review | Martinho Simões | |
ΔfH°gas | -1556.7 ± 3.9 | kJ/mol | Review | Martinho Simões | |
ΔfH°gas | -1560. ± 14. | kJ/mol | Review | Martinho Simões | |
ΔfH°gas | -1554.4 ± 7.3 | kJ/mol | Review | Martinho Simões | Selected data. Average of the values from Chernova, Sheiman, et al., 1973, Connor, Skinner, et al., 1973, and Al-Takhin, Connor, et al., 1983 |

Condensed phase thermochemistry data

Data compiled by: José A. Martinho Simões
Quantity | Value | Units | Method | Reference | Comment |
---|---|---|---|---|---|
ΔfH°solid | -1658.0 ± 8.9 | kJ/mol | Review | Martinho Simões | |
ΔfH°solid | -1645.0 ± 6.1 | kJ/mol | Review | Martinho Simões | |
ΔfH°solid | -1657.6 ± 3.4 | kJ/mol | Review | Martinho Simões | |
ΔfH°solid | -1661. ± 14. | kJ/mol | Review | Martinho Simões | |
ΔfH°solid | -1655.3 ± 7.0 | kJ/mol | Review | Martinho Simões | Selected data. Average of the values from Chernova, Sheiman, et al., 1973, Connor, Skinner, et al., 1973, and Al-Takhin, Connor, et al., 1983 |
Quantity | Value | Units | Method | Reference | Comment |
ΔcH°solid | -3589.5 ± 2.5 | kJ/mol | CC-SB | Chernova, Sheiman, et al., 1973 | Please also see Tel'noi and Rabinovich, 1977. |

Phase change data

Data compiled as indicated in comments:
AC - William E. Acree, Jr., James S. Chickos
MS - José A. Martinho Simões
Quantity | Value | Units | Method | Reference | Comment |
---|---|---|---|---|---|
ΔsubH° | 101. ± 2. | kJ/mol | CC-SB | Al-Takhin, Connor, et al., 1983 | Another literature value for the enthalpy of sublimation has been reported: 93.3 ± 4.2 kJ/mol Brown, Connor, et al., 1974 Baev, Dem'yanchuk, et al., 1971 Lemoine, Gross, et al., 1975; MS |
ΔsubH° | 101. ± 2. | kJ/mol | N/A | Al-Takhin, Connor, et al., 1983, 2 | AC |
ΔsubH° | 93.3 ± 4.2 | kJ/mol | N/A | Pilcher and Skinner, 1983 | See also Lalage, Brown, et al., 1974.; AC |
Enthalpy of vaporization
ΔvapH (kJ/mol) | Temperature (K) | Reference | Comment |
---|---|---|---|
68.7 | 468. | Baev, Dem'yanchuk, et al., 1971 | Based on data from 454. to 483. K.; AC |
Enthalpy of sublimation
ΔsubH (kJ/mol) | Temperature (K) | Method | Reference | Comment |
---|---|---|---|---|
77.6 | 406. | MM | Baev, Dem'yanchuk, et al., 1971 | Based on data from 363. to 450. K.; AC |

Reaction thermochemistry data

Data compiled by: José A. Martinho Simões
Individual Reactions
(solution) +
(solution) = 2C10MnO10Re (solution)
By formula: C10Mn2O10 (solution) + C10O10Re2 (solution) = 2C10MnO10Re (solution)
Quantity | Value | Units | Method | Reference | Comment |
---|---|---|---|---|---|
ΔrH° | 121. ± 31. | kJ/mol | PC | Harel and Adamson, 1986 | solvent: Cyclohexane; The reaction enthalpy was calculated from the enthalpies of the following reactions: Mn2(CO)10(solution) + I2(solution) = 2Mn(CO)5(I)(solution), -187.9 ± 8.4 kJ/mol, Re2(CO)10(solution) + I2(solution) = 2Re(CO)5(I)(solution), -157. ± 16. kJ/mol, and MnRe(CO)10(solution) + I2(solution) = Mn(CO)5(I)(solution) + Re(CO)5(I)(solution), -233. ± 13. kJ/mol |
ΔrH° | 34.4 ± 1.3 | kJ/mol | EqS | Marcomini and Poë, 1984 | solvent: Decalin; Temperature range: 443-463 K |
(solution) = 2C5O5Re (solution)
By formula: C10O10Re2 (solution) = 2C5O5Re (solution)
Quantity | Value | Units | Method | Reference | Comment |
---|---|---|---|---|---|
ΔrH° | >166. | kJ/mol | KinS | Marcomini and Poë, 1984 | solvent: Decalin; Please also see Poë, 1981. The reaction enthalpy was derived from the enthalpy of activation, 165.5 ± 0.8 kJ/mol Poë, 1981, by assuming a negligible barrier for the radical recombination. This procedure was later considered to yield a low limit of the reaction enthalpy Poë, 1983 Marcomini and Poë, 1984 Marcomini and Poë, 1983 Coville, Stolzenberg, et al., 1983. See also Schmidt, Trogler, et al., 1984 |
By formula: C10O10Re2 (cr) + I2 (cr) = 2C5IO5Re (cr)
Quantity | Value | Units | Method | Reference | Comment |
---|---|---|---|---|---|
ΔrH° | -172. ± 18. | kJ/mol | PC | Harel and Adamson, 1986 | The reaction enthalpy was calculated from the enthalpy of the same reaction in cyclohexane, -157. ± 16. kJ/mol, and from the solution enthalpies of Re2(CO)10(cr), 34.3 ± 2.1 kJ/mol, I2(cr), 20.5 ± 0.4 kJ/mol, and Re(CO)5(I)(cr), 34.7 ± 4.2 kJ/mol Harel and Adamson, 1986 |
(solution) +
(solution) = 2
(solution)
By formula: C10O10Re2 (solution) + I2 (solution) = 2C5IO5Re (solution)
Quantity | Value | Units | Method | Reference | Comment |
---|---|---|---|---|---|
ΔrH° | -157. ± 16. | kJ/mol | PC | Harel and Adamson, 1986 | solvent: Cyclohexane; Please also see Adamson, Vogler, et al., 1978. |
By formula: C10O10Re2 (cr) = 10CO (g) + 2Re (cr)
Quantity | Value | Units | Method | Reference | Comment |
---|---|---|---|---|---|
ΔrH° | 539.7 ± 5.9 | kJ/mol | TD-HFC | Connor, Skinner, et al., 1973 | |
ΔrH° | 552.3 ± 3.0 | kJ/mol | HAL-HFC | Connor, Skinner, et al., 1973 |

Gas phase ion energetics data

Data compiled as indicated in comments:
LLK - Sharon G. Lias, Rhoda D. Levin, and Sherif A. Kafafi
RDSH - Henry M. Rosenstock, Keith Draxl, Bruce W. Steiner, and John T. Herron
Ionization energy determinations
IE (eV) | Method | Reference | Comment |
---|---|---|---|
8.49 ± 0.02 | EI | Michels and Svec, 1981 | LLK |
8.36 ± 0.03 | EI | Junk and Svec, 1970 | RDSH |
8.07 | PE | Higginson, Lloyd, et al., 1975 | Vertical value; LLK |
8.86 | PE | Hall, 1975 | Vertical value; LLK |
Appearance energy determinations
Ion | AE (eV) | Other Products | Method | Reference | Comment |
---|---|---|---|---|---|
CORe2+ | 26.26 | 9CO | EI | Svec and Junk, 1967 | RDSH |
C2O2Re2+ | 23.55 | 8CO | EI | Svec and Junk, 1967 | RDSH |
C3O3Re2+ | 21.46 | 7CO | EI | Svec and Junk, 1967 | RDSH |
C4O4Re+ | 13.30 | ? | EI | Svec and Junk, 1967 | RDSH |
C4O4Re2+ | 19.31 | 6CO | EI | Svec and Junk, 1967 | RDSH |
C5O5Re+ | 10.34 | ? | EI | Junk and Svec, 1970 | RDSH |
C5O5Re2+ | 16.71 | 5CO | EI | Svec and Junk, 1967 | RDSH |
C6O6Re2+ | 15.01 | 4CO | EI | Svec and Junk, 1967 | RDSH |
C7O7Re2+ | 13.55 | 3CO | EI | Svec and Junk, 1967 | RDSH |
C8O8Re2+ | 10.89 | 2CO | EI | Svec and Junk, 1967 | RDSH |
C9O9Re2+ | 9.57 | CO | EI | Svec and Junk, 1967 | RDSH |
Re+ | 37.55 | ? | EI | Svec and Junk, 1967 | RDSH |
Re2+ | 28.96 | 10CO | EI | Svec and Junk, 1967 | RDSH |

References

Martinho Simões
Martinho Simões, J.A.,
Private communication (see http://webbook.nist.gov/chemistry/om/). [all data]
Chernova, Sheiman, et al., 1973
Chernova, V.I.; Sheiman, M.S.; Rabinovich, I.B.; Syrkin, V.G.,
Trudy Khim. Khim. Tekhnol., Gorky, 1973, No. 2, 43. [all data]
Connor, Skinner, et al., 1973
Connor, J.A.; Skinner, H.A.; Virmani, Y.,
High temperature microcalorimetric studies of the thermal decomposition and iodination of polynuclear carbonyls of Fe, Co, Ru, Rh, Re, Os and Ir,
Faraday Symp. Chem. Soc., 1973, 8, 18, https://doi.org/10.1039/fs9730800018
. [all data]
Al-Takhin, Connor, et al., 1983
Al-Takhin, G.; Connor, J.A.; Skinner, H.A.,
J. Organomet. Chem., 1983, 259, 313. [all data]
Tel'noi and Rabinovich, 1977
Tel'noi, V.I.; Rabinovich, I.B.,
Russ. Chem. Rev., 1977, 46, 689. [all data]
Brown, Connor, et al., 1974
Brown, D.L.S.; Connor, J.A.; Skinner, H.A.,
J. Organometal. Chem., 1974, 81, 403. [all data]
Baev, Dem'yanchuk, et al., 1971
Baev, A.K.; Dem'yanchuk, V.V.; Mirzoev, G.; Noikov, G.I.; Kolobova, N.E.,
Russ. J. Phys. Chem., 1971, 45, 6, 777. [all data]
Lemoine, Gross, et al., 1975
Lemoine, P.; Gross, M.; Bousquet, J.; Letoffe, J.M.; Diot, M.,
J. Chem. Thermodyn., 1975, 7, 913. [all data]
Al-Takhin, Connor, et al., 1983, 2
Al-Takhin, Ghassan; Connor, Joseph A.; Skinner, Henry A.,
Enthalpies of formation of decacarbonyldirhenium and some pentacarbonylrhenium derivatives,
Journal of Organometallic Chemistry, 1983, 259, 3, 313-320, https://doi.org/10.1016/0022-328X(83)87182-4
. [all data]
Pilcher and Skinner, 1983
Pilcher, G.; Skinner, H.A.,
Thermochemistry of organometallic compounds, 1983, 43-90, https://doi.org/10.1002/9780470771686.ch2
. [all data]
Lalage, Brown, et al., 1974
Lalage, D.; Brown, S.; Connor, Joseph A.; Skinner, Henry A.,
The enthalpies of formation of CH3Mn(CO)5 and of CH3Re(CO)5, and the strengths of the CH3«58872»Mn and CH3«58872»Re bonds,
Journal of Organometallic Chemistry, 1974, 81, 3, 403-409, https://doi.org/10.1016/S0022-328X(00)88209-1
. [all data]
Harel and Adamson, 1986
Harel, Y.; Adamson, A.W.,
J. Phys. Chem., 1986, 90, 6693. [all data]
Marcomini and Poë, 1984
Marcomini, A.; Poë, A.,
J. Chem. Soc., Dalton Trans., 1984, 95.. [all data]
Poë, 1981
Poë, A.,
ACS Symp. Ser., 1981, No. 155, 135. [all data]
Poë, 1983
Poë, A.,
Chem. Brit., 1983, 19, 997. [all data]
Marcomini and Poë, 1983
Marcomini, A.; Poë, A.,
J. Am. Chem. Soc., 1983, 105, 6952. [all data]
Coville, Stolzenberg, et al., 1983
Coville, N.J.; Stolzenberg, A.M.; Muetterties, E.L.,
J. Am. Chem. Soc., 1983, 105, 2499. [all data]
Schmidt, Trogler, et al., 1984
Schmidt, S.P.; Trogler, W.C.; Basolo, F.,
J. Am. Chem. Soc., 1984, 106, 1308. [all data]
Adamson, Vogler, et al., 1978
Adamson, A.W.; Vogler, A.; Kunkely, H.; Wachter, R.,
J. Am. Chem. Soc., 1978, 100, 1298. [all data]
Michels and Svec, 1981
Michels, G.D.; Svec, H.J.,
Characterization of MnTc(CO)10 and TcRe(CO)10,
Inorg. Chem., 1981, 20, 3445. [all data]
Junk and Svec, 1970
Junk, G.A.; Svec, H.J.,
The mass spectra, ionization potentials, and bond energies of the group VIIA decacarbonyls,
J. Chem. Soc. A, 1970, 2102. [all data]
Higginson, Lloyd, et al., 1975
Higginson, B.R.; Lloyd, D.R.; Evans, S.; Orchard, A.F.,
Photoelectron studies of metal carbonyls. Part 5. - Substituted group VIIA carbonyls,
J. Chem. Soc. Faraday Trans. 2, 1975, 71, 1913. [all data]
Hall, 1975
Hall, M.B.,
The use of spin-orbit coupling in the interpretation of photoelectron spectra. I. Application to substituted rhenium pentacarbonyls,
J. Am. Chem. Soc., 1975, 97, 2057. [all data]
Svec and Junk, 1967
Svec, H.J.; Junk, G.A.,
Energetics of the ionization and dissociation of Mn2(CO)10, Re2(CO)10, and ReMn(CO)10,
J. Am. Chem. Soc., 1967, 89, 2836. [all data]