(E)-Pent-1-yne-3-ene, 3-ethyl-
- Formula: C7H10
- Molecular weight: 94.1543
- IUPAC Standard InChIKey: UNFQVPAAWFRBRN-ALCCZGGFSA-N
- CAS Registry Number: 14272-82-3
- Chemical structure:
View 3d structure (requires JavaScript / HTML 5) - Permanent link for this species. Use this link for bookmarking this species for future reference.

Gas phase ion energetics data

Data compiled as indicated in comments:
LLK - Sharon G. Lias, Rhoda D. Levin, and Sherif A. Kafafi
Ionization energy determinations
IE (eV) | Method | Reference | Comment |
---|---|---|---|
8.70 ± 0.01 | PE | Carlier, Mouvier, et al., 1979 | LLK |

References

Carlier, Mouvier, et al., 1979
Carlier, P.; Mouvier, G.; Mesnard, D.; Miginiac, L.,
Etude par spectrometrie de photoelectrons de la structure electronique des phenyl-alcynes conjugues,
J. Electron Spectrosc. Relat. Phenom., 1979, 16, 147. [all data]