Tetrahydropyran
- Formula: C5H10O
- Molecular weight: 86.1323
- IUPAC Standard InChIKey: DHXVGJBLRPWPCS-UHFFFAOYSA-N
- CAS Registry Number: 142-68-7
- Chemical structure:
View 3d structure (requires JavaScript / HTML 5) - Other names: Oxacyclohexane; Oxane; 2H-Pyran, tetrahydro-; Pentamethylene oxide; Tetrahydro-2H-pyran; THP

Gas phase thermochemistry data

Data compiled as indicated in comments:
ALS - Hussein Y. Afeefy, Joel F. Liebman, and Stephen E. Stein
GT - Glushko Thermocenter, Russian Academy of Sciences, Moscow
Quantity | Value | Units | Method | Reference | Comment |
---|---|---|---|---|---|
ΔfH°gas | -223.8 ± 1.0 | kJ/mol | Cm | Pell and Pilcher, 1965 | ALS |
ΔfH°gas | -220. ± 3. | kJ/mol | Ccb | Snelson and Skinner, 1961 | ALS |
ΔfH°gas | -223.4 ± 1.5 | kJ/mol | Ccb | Cass, Fletcher, et al., 1958 | Reanalyzed by Cox and Pilcher, 1970, Original value = -212. kJ/mol; ALS |
Quantity | Value | Units | Method | Reference | Comment |
ΔcH°gas | -3173.3 ± 0.96 | kJ/mol | Cm | Pell and Pilcher, 1965 | Corresponding ΔfHºgas = -223.4 kJ/mol (simple calculation by NIST; no Washburn corrections); ALS |
Constant pressure heat capacity of gas
Cp,gas (J/mol*K) | Temperature (K) | Reference | Comment |
---|---|---|---|
33.90 | 50. | Dorofeeva O.V., 1992 | p=1 bar. Selected values are in close agreement with those calculated by [ Vedal D., 1975].; GT |
41.62 | 100. | ||
53.05 | 150. | ||
66.28 | 200. | ||
90.06 | 273.15 | ||
99.1 ± 3.0 | 298.15 | ||
99.82 | 300. | ||
137.09 | 400. | ||
171.01 | 500. | ||
199.70 | 600. | ||
223.66 | 700. | ||
243.80 | 800. | ||
260.83 | 900. | ||
275.32 | 1000. | ||
287.68 | 1100. | ||
298.26 | 1200. | ||
307.34 | 1300. | ||
315.16 | 1400. | ||
321.92 | 1500. |

Condensed phase thermochemistry data

Data compiled as indicated in comments:
ALS - Hussein Y. Afeefy, Joel F. Liebman, and Stephen E. Stein
DH - Eugene S. Domalski and Elizabeth D. Hearing
Quantity | Value | Units | Method | Reference | Comment |
---|---|---|---|---|---|
ΔfH°liquid | -255. ± 2. | kJ/mol | Ccb | Snelson and Skinner, 1961 | ALS |
Quantity | Value | Units | Method | Reference | Comment |
ΔcH°liquid | -3141.9 ± 1.3 | kJ/mol | Ccb | Snelson and Skinner, 1961 | Corresponding ΔfHºliquid = -254.8 kJ/mol (simple calculation by NIST; no Washburn corrections); ALS |
ΔcH°liquid | -3150. ± 6.3 | kJ/mol | Ccb | Cass, Fletcher, et al., 1958 | Corresponding ΔfHºliquid = -247. kJ/mol (simple calculation by NIST; no Washburn corrections); ALS |
ΔcH°liquid | -3137.6 ± 0.84 | kJ/mol | Ccb | Skuratov, Strepikheev, et al., 1957 | Reanalyzed by Cox and Pilcher, 1970, Original value = -3138. ± 0.8 kJ/mol; Combustion at 293 K; Corresponding ΔfHºliquid = -259.1 kJ/mol (simple calculation by NIST; no Washburn corrections); ALS |
Constant pressure heat capacity of liquid
Cp,liquid (J/mol*K) | Temperature (K) | Reference | Comment |
---|---|---|---|
149.60 | 298.15 | Inglese, Grolier, et al., 1984 | DH |
149.21 | 298.15 | Inglese, Castagnolo, et al., 1981 | DH |
140.6 | 298. | Conti, Gianni, et al., 1976 | DH |
151.13 | 297.62 | Moelwyn-Hughes and Thorpe, 1964 | T = 297 to 327 K.; DH |

Phase change data

Data compiled as indicated in comments:
BS - Robert L. Brown and Stephen E. Stein
TRC - Thermodynamics Research Center, NIST Boulder Laboratories, Chris Muzny director
AC - William E. Acree, Jr., James S. Chickos
DRB - Donald R. Burgess, Jr.
ALS - Hussein Y. Afeefy, Joel F. Liebman, and Stephen E. Stein
Quantity | Value | Units | Method | Reference | Comment |
---|---|---|---|---|---|
Tboil | 361.0 ± 0.7 | K | AVG | N/A | Average of 8 values; Individual data points |
Quantity | Value | Units | Method | Reference | Comment |
Tfus | 224. | K | N/A | Guieu, Carbonnel, et al., 1985 | Crystal phase 1 phase; Uncertainty assigned by TRC = 0.1 K; TRC |
Tfus | 224.15 | K | N/A | Brooks and Pilcher, 1959 | Uncertainty assigned by TRC = 1. K; TRC |
Tfus | 223.95 | K | N/A | Anonymous, 1942 | Uncertainty assigned by TRC = 0.3 K; TRC |
Quantity | Value | Units | Method | Reference | Comment |
Tc | 572.2 | K | N/A | Kobe and Mathews, 1970 | Uncertainty assigned by TRC = 0.3 K; TRC |
Quantity | Value | Units | Method | Reference | Comment |
Pc | 47.70 | bar | N/A | Kobe and Mathews, 1970 | Uncertainty assigned by TRC = 0.1418 bar; TRC |
Quantity | Value | Units | Method | Reference | Comment |
ρc | 3.8124 | mol/l | N/A | Kobe and Mathews, 1970 | Uncertainty assigned by TRC = 0.0056 mol/l; TRC |
Quantity | Value | Units | Method | Reference | Comment |
ΔvapH° | 34.67 | kJ/mol | N/A | Majer and Svoboda, 1985 | |
ΔvapH° | 38.2 ± 1.1 | kJ/mol | DSC | Rojas-Aguilar, Ginez-Carbajal, et al., 2005 | AC |
ΔvapH° | 35.0 | kJ/mol | N/A | Snelson and Skinner, 1961 | DRB |
ΔvapH° | 34.9 | kJ/mol | V | Cass, Fletcher, et al., 1958 | ALS |
Enthalpy of vaporization
ΔvapH (kJ/mol) | Temperature (K) | Method | Reference | Comment |
---|---|---|---|---|
31.17 | 361. | N/A | Majer and Svoboda, 1985 | |
36. | 301. | N/A | Rodríguez, Giner, et al., 2006 | Based on data from 286. to 361. K.; AC |
33.2 | 350. | N/A | Rodriguez, Artigas, et al., 2000 | Based on data from 335. to 412. K.; AC |
35.0 | 288. | A | Stephenson and Malanowski, 1987 | Based on data from 273. to 362. K.; AC |
35.0 | 281. | N/A | Dykyj, 1972 | Based on data from 273. to 288. K. See also Cass, Fletcher, et al., 1958, 2.; AC |
36. | 293. | V | Skuratov, Strepikheev, et al., 1957 | Combustion at 293 K; ALS |

Reaction thermochemistry data

Data compiled by: Hussein Y. Afeefy, Joel F. Liebman, and Stephen E. Stein
Individual Reactions
By formula: C5H8O + H2 = C5H10O
Quantity | Value | Units | Method | Reference | Comment |
---|---|---|---|---|---|
ΔrH° | -103.3 ± 1.0 | kJ/mol | Chyd | Allinger, Glaser, et al., 1981 | liquid phase; solvent: Hexane |

Henry's Law data

Data compiled by: Rolf Sander
Henry's Law constant (water solution)
kH(T) = k°H exp(d(ln(kH))/d(1/T) ((1/T) - 1/(298.15 K)))
k°H = Henry's law constant for solubility in water at 298.15 K (mol/(kg*bar))
d(ln(kH))/d(1/T) = Temperature dependence constant (K)
k°H (mol/(kg*bar)) | d(ln(kH))/d(1/T) (K) | Method | Reference |
---|---|---|---|
7.9 | 5900. | M | N/A |

Gas phase ion energetics data

Data evaluated as indicated in comments:
HL - Edward P. Hunter and Sharon G. Lias
L - Sharon G. Lias
Data compiled as indicated in comments:
MM - Michael M. Meot-Ner (Mautner)
LL - Sharon G. Lias and Joel F. Liebman
LLK - Sharon G. Lias, Rhoda D. Levin, and Sherif A. Kafafi
RDSH - Henry M. Rosenstock, Keith Draxl, Bruce W. Steiner, and John T. Herron
Quantity | Value | Units | Method | Reference | Comment |
---|---|---|---|---|---|
IE (evaluated) | 9.25 ± 0.01 | eV | N/A | N/A | L |
Quantity | Value | Units | Method | Reference | Comment |
Proton affinity (review) | 822.8 | kJ/mol | N/A | Hunter and Lias, 1998 | HL |
Quantity | Value | Units | Method | Reference | Comment |
Gas basicity | 795.4 | kJ/mol | N/A | Hunter and Lias, 1998 | HL |
Gas basicity at 298K
Gas basicity (review) (kJ/mol) | Reference | Comment |
---|---|---|
799.1 ± 0.1 | Decouzon, Gal, et al., 1996 | T = 338K; MM |
799.2 | Decouzon, Gal, et al., 1996 | T = T(eff) = 430K; MM |
Ionization energy determinations
IE (eV) | Method | Reference | Comment |
---|---|---|---|
9.24 ± 0.05 | EI | Holmes and Lossing, 1991 | LL |
9.16 | PE | Behan, Dean, et al., 1976 | LLK |
9.25 ± 0.01 | S | Hernandez, 1963 | RDSH |
9.26 ± 0.03 | PI | Watanabe, Nakayama, et al., 1962 | RDSH |
9.57 | PE | Kimura, Katsumata, et al., 1981 | Vertical value; LLK |
9.46 | PE | Planckaert, Doucet, et al., 1974 | Vertical value; LLK |
9.48 | PE | Kobayashi and Nagakura, 1973 | Vertical value; LLK |
9.50 | PE | Sweigart and Turner, 1972 | Vertical value; LLK |
Appearance energy determinations
Ion | AE (eV) | Other Products | Method | Reference | Comment |
---|---|---|---|---|---|
C2H4+ | ~13.8 | ? | EI | Collin and Conde-Caprace, 1966 | RDSH |
C2H5O+ | 11.56 | ? | EI | Collin and Conde-Caprace, 1966 | RDSH |
C3H5+ | ~12.8 | ? | EI | Collin and Conde-Caprace, 1966 | RDSH |
C4H7+ | ~12.2 | CH2O+H | EI | Collin and Conde-Caprace, 1966 | RDSH |
C4H8+ | 11.88 | CH2O? | EI | Collin and Conde-Caprace, 1966 | RDSH |
C5H9O+ | 11.22 | H | EI | Collin and Conde-Caprace, 1966 | RDSH |

Kovats' RI, non-polar column, isothermal

Column type | Active phase | Temperature (C) | I | Reference | Comment |
---|---|---|---|---|---|
Packed | Apiezon L | 120. | 709. | Bogoslovsky, Anvaer, et al., 1978 | Celite 545 |
Packed | Apiezon L | 160. | 729. | Bogoslovsky, Anvaer, et al., 1978 | Celite 545 |
Packed | Apiezon L | 130. | 714. | Bogoslovsky, Anvaer, et al., 1978 | |
Packed | Apiezon L | 170. | 720. | Jonas, Janák, et al., 1966 | H2 |
Packed | Apiezon L | 170. | 740. | Jonas, Janák, et al., 1966 | H2 |
Packed | Apiezon L | 170. | 740. | Jonas, Kratochvíl, et al., 1966 | Column length: 2. m |
Packed | Apiezon L | 130. | 714. | Wehrli and Kováts, 1959 | Celite; Column length: 2.25 m |
Packed | Apiezon L | 70. | 697. | Wehrli and Kováts, 1959 | Celite; Column length: 2.25 m |

Kovats' RI, polar column, isothermal

Column type | Active phase | Temperature (C) | I | Reference | Comment |
---|---|---|---|---|---|
Packed | PEG-2000 | 150. | 972. | Anderson, Jurel, et al., 1973 | He, Celite 545 (44-60 mesh); Column length: 3. m |
Packed | PEG-2000 | 152. | 988. | Anderson, Jurel, et al., 1973 | He, Celite 545 (44-60 mesh); Column length: 3. m |
Packed | PEG-2000 | 179. | 1010. | Anderson, Jurel, et al., 1973 | He, Celite 545 (44-60 mesh); Column length: 3. m |
Packed | PEG-2000 | 180. | 969. | Anderson, Jurel, et al., 1973 | He, Celite 545 (44-60 mesh); Column length: 3. m |
Packed | PEG-2000 | 200. | 965. | Anderson, Jurel, et al., 1973 | He, Celite 545 (44-60 mesh); Column length: 3. m |

Normal alkane RI, non-polar column, isothermal

Column type | Active phase | Temperature (C) | I | Reference | Comment |
---|---|---|---|---|---|
Packed | Apieson L | 120. | 736. | Kurdina, Markovich, et al., 1969 | not specified, not specified |
Packed | Apieson L | 120. | 714. | Kurdina, Markovich, et al., 1969 | not specified, not specified |
Packed | Apieson L | 120. | 714. | Kurdina, Markovich, et al., 1969 | not specified, not specified |

Normal alkane RI, non-polar column, custom temperature program

Column type | Active phase | I | Reference | Comment |
---|---|---|---|---|
Capillary | Methyl Silicone | 689. | Farkas, Héberger, et al., 2004 | Program: not specified |
Capillary | SE-30 | 690. | Vinogradov, 2004 | Program: not specified |
Capillary | Methyl Silicone | 689. | Zenkevich, 1998 | Program: not specified |

Normal alkane RI, polar column, custom temperature program

Column type | Active phase | I | Reference | Comment |
---|---|---|---|---|
Capillary | Carbowax 20M | 930. | Vinogradov, 2004 | Program: not specified |
Capillary | Carbowax 400, Carbowax 20M, Carbowax 1540, Carbowax 4000, Superox 06, PEG 20M, etc. | 930. | Waggott and Davies, 1984 | Hydrogen; Column length: 50. m; Column diameter: 0.32 mm; Program: not specified |

References

Pell and Pilcher, 1965
Pell, A.S.; Pilcher, G.,
Measurements of heats of combustion by flame calorimetry. Part 3.-Ethylene oxide, trimethylene oxide, tetrahydrofuran and tetrahydropy,
Trans. Faraday Soc., 1965, 61, 71-77. [all data]
Snelson and Skinner, 1961
Snelson, A.; Skinner, H.A.,
Heats of combustion: sec-propanol, 1,4-dioxan, 1,3-dioxan and tetrahydropyran,
Trans. Faraday Soc., 1961, 57, 2125-2131. [all data]
Cass, Fletcher, et al., 1958
Cass, R.C.; Fletcher, S.E.; Mortimer, C.T.; Springall, H.D.; White, T.R.,
Heats of combustion and molecular structure. Part V. The mean bond energy term for the C-O bond in ethers, and the structures of some cyclic ethers,
J. Chem. Soc., 1958, 1406-1410. [all data]
Cox and Pilcher, 1970
Cox, J.D.; Pilcher, G.,
Thermochemistry of Organic and Organometallic Compounds, Academic Press, New York, 1970, 1-636. [all data]
Dorofeeva O.V., 1992
Dorofeeva O.V.,
Ideal gas thermodynamic properties of oxygen heterocyclic compounds. Part 2. Six-membered, seven-membered and eight-membered rings,
Thermochim. Acta, 1992, 200, 121-150. [all data]
Vedal D., 1975
Vedal D.,
Vibrational spectra of pentamethylene sulfide and selenide,
Spectrochim. Acta, 1975, A31, 355-372. [all data]
Skuratov, Strepikheev, et al., 1957
Skuratov, S.M.; Strepikheev, A.A.; Kozina, M.P.,
About the reaction activity of five and six-membered heterocyclic compounds,
Dokl. Akad. Nauk SSSR, 1957, 117, 452-454. [all data]
Inglese, Grolier, et al., 1984
Inglese, A.; Grolier, J.-P.E.; Wilhelm, E.,
Excess volumes and excess heat capacities of oxane + cyclohexane and 1,4-dioxane + cyclohexane,
Fluid Phase Equilibria, 1984, 15, 287-294. [all data]
Inglese, Castagnolo, et al., 1981
Inglese, A.; Castagnolo, M.; Dell'Atti, A.; DeGiglio, A.,
Thermochim. Acta, 1981, 77-87. [all data]
Conti, Gianni, et al., 1976
Conti, G.; Gianni, P.; Matteoli, E.; Mengheri, M.,
Capacita termiche molari di alcuni composti organici mono- e bifunzionali nel liquido puro e in soluzione acquosa a 25C,
Chim. Ind. (Milan), 1976, 58, 225. [all data]
Moelwyn-Hughes and Thorpe, 1964
Moelwyn-Hughes, E.A.; Thorpe, P.L.,
The physical and thermodynamic properties of some associated solutions. II. Heat capacities and compressibilities,
Proc. Roy. Soc. (London), 1964, 278A, 574-587. [all data]
Guieu, Carbonnel, et al., 1985
Guieu, R.; Carbonnel, L.; Kehiaian, H.V.,
Solutions solides organiques I. Etude des diagrammes de phases des systemes oxanne ou 1,4-dioxanne + cyclohexane,
Bull. Soc. Chim. Fr., 1985, 1985, 709. [all data]
Brooks and Pilcher, 1959
Brooks, J.H.; Pilcher, G.,
A Simple Melting Point Calorimeter for Moderately Precise Determination of Purity,
J. Chem. Soc., 1959, 1959, 1535. [all data]
Anonymous, 1942
Anonymous, R.,
, Am. Pet. Inst. Res. Proj. 6, Natl. Bur. Stand., 1942. [all data]
Kobe and Mathews, 1970
Kobe, K.A.; Mathews, J.F.,
Critical Properties and Vapor Pressures of Some Organic Nitrogen and Oxygen Compounds,
J. Chem. Eng. Data, 1970, 15, 182. [all data]
Majer and Svoboda, 1985
Majer, V.; Svoboda, V.,
Enthalpies of Vaporization of Organic Compounds: A Critical Review and Data Compilation, Blackwell Scientific Publications, Oxford, 1985, 300. [all data]
Rojas-Aguilar, Ginez-Carbajal, et al., 2005
Rojas-Aguilar, A.; Ginez-Carbajal, F.; Orozco-Guareno, E.; Flores-Segura, H.,
Measurement of enthalpies of vaporization of volatile heterocyclic compounds by DSC,
J Therm Anal Calorim, 2005, 79, 1, 95-100, https://doi.org/10.1007/s10973-004-0568-3
. [all data]
Rodríguez, Giner, et al., 2006
Rodríguez, S.; Giner, B.; Haro, M.; Martín, S.; Artigas, H.,
Isobaric vapour--liquid equilibrium for the binary systems formed by a cyclic ether and bromocyclohexane at 40.0 and 101.3 kPa,
Physics and Chemistry of Liquids, 2006, 44, 3, 275-285, https://doi.org/10.1080/00319100600574168
. [all data]
Rodriguez, Artigas, et al., 2000
Rodriguez, S.; Artigas, H.; Lafuente, C.; Mainar, A.M.; Royo, F.M.,
Isobaric vapour--liquid equilibrium of binary mixtures of some cyclic ethers with chlorocyclohexane at 40.0 and 101.3 kPa,
Thermochimica Acta, 2000, 362, 1-2, 153-160, https://doi.org/10.1016/S0040-6031(00)00580-3
. [all data]
Stephenson and Malanowski, 1987
Stephenson, Richard M.; Malanowski, Stanislaw,
Handbook of the Thermodynamics of Organic Compounds, 1987, https://doi.org/10.1007/978-94-009-3173-2
. [all data]
Dykyj, 1972
Dykyj, J.,
Petrochemia, 1972, 12, 1, 13. [all data]
Cass, Fletcher, et al., 1958, 2
Cass, R.C.; Fletcher, S.E.; Mortimer, C.T.; Quincey, P.G.; Springall, H.D.,
193. Heats of combustion and molecular structure. Part IV. Aliphatic nitroalkanes and nitric esters,
J. Chem. Soc., 1958, 958, https://doi.org/10.1039/jr9580000958
. [all data]
Allinger, Glaser, et al., 1981
Allinger, N.L.; Glaser, J.A.; Davis, H.E.,
Heats of hydrogenation of some vinyl ethers and related compounds,
J. Org. Chem., 1981, 46, 658-661. [all data]
Hunter and Lias, 1998
Hunter, E.P.; Lias, S.G.,
Evaluated Gas Phase Basicities and Proton Affinities of Molecules: An Update,
J. Phys. Chem. Ref. Data, 1998, 27, 3, 413-656, https://doi.org/10.1063/1.556018
. [all data]
Decouzon, Gal, et al., 1996
Decouzon, M.; Gal, J.E.; Herreros, M.; Marai, P.C.; Murrell, J.; Todd, J.F.J.,
On the Use of the Kinetic Method for the Determination of Proton Affinities by Fourier-Transfrom Ion Cyclotron Resonance Mass Spectrometry,
Rapid. Comm. Mass Spectrom., 1996, 10, 242. [all data]
Holmes and Lossing, 1991
Holmes, J.L.; Lossing, F.P.,
Ionization energies of homologous organic compounds and correlation with molecular size,
Org. Mass Spectrom., 1991, 26, 537. [all data]
Behan, Dean, et al., 1976
Behan, J.M.; Dean, F.M.; Johnstone, R.A.W.,
Photoelectron spectra of cyclic aromatic ethers. The question of the Mills-Nixon effect,
Tetrahedron, 1976, 32, 167. [all data]
Hernandez, 1963
Hernandez, G.J.,
Vacuum-ultraviolet absorption spectra of the cyclic ethers: trimethylene oxide, tetrahydrofuran, and tetrahydropyran,
J. Chem. Phys., 1963, 38, 2233. [all data]
Watanabe, Nakayama, et al., 1962
Watanabe, K.; Nakayama, T.; Mottl, J.,
Ionization potentials of some molecules,
J. Quant. Spectry. Radiative Transfer, 1962, 2, 369. [all data]
Kimura, Katsumata, et al., 1981
Kimura, K.; Katsumata, S.; Achiba, Y.; Yamazaki, T.; Iwata, S.,
Ionization energies, Ab initio assignments, and valence electronic structure for 200 molecules
in Handbook of HeI Photoelectron Spectra of Fundamental Organic Compounds, Japan Scientific Soc. Press, Tokyo, 1981. [all data]
Planckaert, Doucet, et al., 1974
Planckaert, A.A.; Doucet, J.; Sandorfy, C.,
Comparative study of the vacuum ultraviolet absorption and photoelectron spectra of some simple ethers and thioethers,
J. Chem. Phys., 1974, 60, 4846. [all data]
Kobayashi and Nagakura, 1973
Kobayashi, T.; Nagakura, S.,
Photoelectron spectra of tetrahydropyran, 1,3-dioxane, and 1,4-dioxane,
Bull. Chem. Soc. Jpn., 1973, 46, 1558. [all data]
Sweigart and Turner, 1972
Sweigart, D.A.; Turner, D.W.,
Lone pair orbitals and their interactions studied by photoelectron spectroscopy. II. Equivalent orbitals in saturated oxygen and sulfur J. Heterocycl. Chem.,
J. Am. Chem. Soc., 1972, 94, 5599. [all data]
Collin and Conde-Caprace, 1966
Collin, J.E.; Conde-Caprace, G.,
Ionization and dissociation of cyclic ethers by electron impact,
Intern. J. Mass Spectrom. Ion Phys., 1966, 1, 213. [all data]
Pickett, Hoeflich, et al., 1951
Pickett, L.W.; Hoeflich, N.J.; Liu, T.-C.,
The vacuum ultraviolet absorption spectra of cyclic compounds. II. Tetrahydrofuran, tetrahydropyran, 1,4-dioxane and furan,
J. Am. Chem. Soc., 1951, 73, 4865-4869. [all data]
Bogoslovsky, Anvaer, et al., 1978
Bogoslovsky, Yu.N.; Anvaer, B.I.; Vigdergauz, M.S.,
Chromatographic constants in gas chromatography (in Russian), Standards Publ. House, Moscow, 1978, 192. [all data]
Jonas, Janák, et al., 1966
Jonas, J.; Janák, J.; Kratochvíl, M.,
Structural investigations with the aid of Kovats retention index system on one (nonpolar) stationary phase,
J. Gas Chromatogr., 1966, 4, 9, 332-335, https://doi.org/10.1093/chromsci/4.9.332
. [all data]
Jonas, Kratochvíl, et al., 1966
Jonas, J.; Kratochvíl, M.; Gross, H.; Janák, J.,
Über α-halogenäther XXV. Verwendung des Kovatsschen retentionsiondexsystems zur identifizierung von acetalen der tetrahydropyranreihe,
Collect. Czech. Chem. Commun., 1966, 31, 6, 2399-2409, https://doi.org/10.1135/cccc19662399
. [all data]
Wehrli and Kováts, 1959
Wehrli, A.; Kováts, E.,
Gas-chromatographische Charakterisierung ogranischer Verbindungen. Teil 3: Berechnung der Retentionsindices aliphatischer, alicyclischer und aromatischer Verbindungen,
Helv. Chim. Acta, 1959, 7, 7, 2709-2736, https://doi.org/10.1002/hlca.19590420745
. [all data]
Anderson, Jurel, et al., 1973
Anderson, A.; Jurel, S.; Shymanska, M.; Golender, L.,
Gas-liquid chromatography of some aliphatic and heterocyclic mono- and pollyfunctional amines. VII. Retention indices of amines in some polar and unpolar stationary phases,
Latv. PSR Zinat. Akad. Vestis Kim. Ser., 1973, 1, 51-63. [all data]
Kurdina, Markovich, et al., 1969
Kurdina, Z.G.; Markovich, V.E.; Sakharov, V.M.,
Gas chromatography of cyclic O-containing compounds
in Gas chromatography, Issue # 10, NIITEKhim, Moscow, 1969, 128-133. [all data]
Farkas, Héberger, et al., 2004
Farkas, O.; Héberger, K.; Zenkevich, I.G.,
Quantitative structure-retention relationships. XIV. Prediction of gas chromatographic retention indices for saturated O-, N-, and S-heterocyclic compounds,
Chemom. Intell. Lab. Syst., 2004, 72, 2, 173-184, https://doi.org/10.1016/j.chemolab.2004.01.012
. [all data]
Vinogradov, 2004
Vinogradov, B.A.,
Production, composition, properties and application of essential oils, 2004, retrieved from http://viness.narod.ru. [all data]
Zenkevich, 1998
Zenkevich, I.G.,
Reciprocally Unambiguous Conformity Between GC Retention Indices and Boiling Points within Two- and Multidimensional Taxonomic Groups of Organic Compounds,
J. Hi. Res. Chromatogr., 1998, 21, 10, 565-568, https://doi.org/10.1002/(SICI)1521-4168(19981001)21:10<565::AID-JHRC565>3.0.CO;2-6
. [all data]
Waggott and Davies, 1984
Waggott, A.; Davies, I.W.,
Identification of organic pollutants using linear temperature programmed retention indices (LTPRIs) - Part II, 1984, retrieved from http://dwi.defra.gov.uk/research/completed-research/reports/dwi0383.pdf. [all data]