Hexanoic acid
- Formula: C6H12O2
- Molecular weight: 116.1583
- IUPAC Standard InChIKey: FUZZWVXGSFPDMH-UHFFFAOYSA-N
- CAS Registry Number: 142-62-1
- Chemical structure:
View 3d structure (requires JavaScript / HTML 5) - Other names: Caproic acid; n-Caproic acid; n-Hexanoic acid; n-Hexoic acid; n-Hexylic acid; Butylacetic acid; Capronic acid; Hexoic acid; Pentiformic acid; Pentylformic acid; 1-Pentanecarboxylic acid; CH3(CH2)4COOH; Pentane-1-carboxylic acid; 1-Hexanoic acid; Hexacid 698; Kyselina kapronova; Pentanecarboxylic acid; NSC 8266

Gas phase thermochemistry data

Data compiled as indicated in comments:
DRB - Donald R. Burgess, Jr.
ALS - Hussein Y. Afeefy, Joel F. Liebman, and Stephen E. Stein
Quantity | Value | Units | Method | Reference | Comment |
---|---|---|---|---|---|
ΔfH°gas | -122. ± 1. | kcal/mol | AVG | N/A | Average of 7 values; Individual data points |

Condensed phase thermochemistry data

Data compiled as indicated in comments:
ALS - Hussein Y. Afeefy, Joel F. Liebman, and Stephen E. Stein
DH - Eugene S. Domalski and Elizabeth D. Hearing
Quantity | Value | Units | Method | Reference | Comment |
---|---|---|---|---|---|
ΔfH°liquid | -139.04 ± 0.25 | kcal/mol | Ccb | Fenwick, Harrop, et al., 1978 | ALS |
ΔfH°liquid | -139.48 ± 0.18 | kcal/mol | Ccb | Adriaanse, Dekker, et al., 1965 | Heat of formation derived by Cox and Pilcher, 1970; ALS |
ΔfH°liquid | -139.98 ± 0.13 | kcal/mol | Ccb | Lebedeva, 1964 | ALS |
Quantity | Value | Units | Method | Reference | Comment |
ΔcH°liquid | -835.16 ± 0.16 | kcal/mol | Ccb | Fenwick, Harrop, et al., 1978 | Corresponding ΔfHºliquid = -139.04 kcal/mol (simple calculation by NIST; no Washburn corrections); ALS |
ΔcH°liquid | -834.7 ± 0.1 | kcal/mol | Ccb | Adriaanse, Dekker, et al., 1965 | Corresponding ΔfHºliquid = -139.5 kcal/mol (simple calculation by NIST; no Washburn corrections); ALS |
ΔcH°liquid | -834.23 ± 0.13 | kcal/mol | Ccb | Lebedeva, 1964 | Corresponding ΔfHºliquid = -139.97 kcal/mol (simple calculation by NIST; no Washburn corrections); ALS |
ΔcH°liquid | -840.8 | kcal/mol | Ccb | Fischer and Wrede, 1904 | Heat of combustion corrected for pressure; Corresponding ΔfHºliquid = -133.4 kcal/mol (simple calculation by NIST; no Washburn corrections); ALS |
Quantity | Value | Units | Method | Reference | Comment |
ΔcH°solid | -841.97 | kcal/mol | Ccb | Lemoult, 1904 | Corresponding ΔfHºsolid = -132.2 kcal/mol (simple calculation by NIST; no Washburn corrections); ALS |
Constant pressure heat capacity of liquid
Cp,liquid (cal/mol*K) | Temperature (K) | Reference | Comment |
---|---|---|---|
53.80 | 298. | von Reis, 1881 | T = 292 to 483 K.; DH |

Phase change data

Data compiled as indicated in comments:
BS - Robert L. Brown and Stephen E. Stein
TRC - Thermodynamics Research Center, NIST Boulder Laboratories, Chris Muzny director
AC - William E. Acree, Jr., James S. Chickos
ALS - Hussein Y. Afeefy, Joel F. Liebman, and Stephen E. Stein
Quantity | Value | Units | Method | Reference | Comment |
---|---|---|---|---|---|
Tboil | 477. ± 4. | K | AVG | N/A | Average of 41 out of 42 values; Individual data points |
Quantity | Value | Units | Method | Reference | Comment |
Tfus | 269.7 | K | N/A | Adriaanse, Dekker, et al., 1964 | Uncertainty assigned by TRC = 0.05 K; TRC |
Tfus | 269.2 | K | N/A | Costello and Bowden, 1958 | Uncertainty assigned by TRC = 0.5 K; TRC |
Tfus | 269. | K | N/A | Timmermans, 1935 | Uncertainty assigned by TRC = 1.5 K; TRC |
Tfus | 269. | K | N/A | Gartenmeister, 1886 | Uncertainty assigned by TRC = 4. K; TRC |
Tfus | 271.4 | K | N/A | Gartenmeister, 1886 | Uncertainty assigned by TRC = 1.5 K; TRC |
Quantity | Value | Units | Method | Reference | Comment |
Tc | 655.1 | K | N/A | Andereya and Chase, 1990 | Uncertainty assigned by TRC = 1. K; TRC |
Tc | 663. | K | N/A | Ambrose and Ghiassee, 1987 | Uncertainty assigned by TRC = 1. K; TRC |
Tc | 669.63 | K | N/A | D'Souza and Teja, 1987 | Uncertainty assigned by TRC = 3. K; Ambrose's procedure; TRC |
Quantity | Value | Units | Method | Reference | Comment |
Pc | 33.33 | atm | N/A | Andereya and Chase, 1990 | Uncertainty assigned by TRC = 0.39 atm; TRC |
Pc | 31.58 | atm | N/A | Ambrose and Ghiassee, 1987 | Uncertainty assigned by TRC = 0.987 atm; TRC |
Pc | 31.1319 | atm | N/A | D'Souza and Teja, 1987 | Uncertainty assigned by TRC = 0.89 atm; Ambrose's procedure; TRC |
Quantity | Value | Units | Method | Reference | Comment |
ΔvapH° | 16.5 ± 0.2 | kcal/mol | GS | Verevkin, 2000 | Based on data from 297. to 328. K.; AC |
ΔvapH° | 17.0 | kcal/mol | CGC | Chickos, Hosseini, et al., 1995 | Based on data from 353. to 393. K.; AC |
ΔvapH° | 17.5 ± 0.48 | kcal/mol | V | Kruif and Oonk, 1979 | ALS |
ΔvapH° | 17.5 ± 0.48 | kcal/mol | TE | Kruif and Oonk, 1979 | Based on data from 270. to 280. K.; AC |
ΔvapH° | 17.0 ± 0.3 | kcal/mol | V | Adriaanse, Dekker, et al., 1965 | Heat of formation derived by Cox and Pilcher, 1970; ALS |
Enthalpy of vaporization
ΔvapH (kcal/mol) | Temperature (K) | Method | Reference | Comment |
---|---|---|---|---|
16.3 ± 0.2 | 313. | GS | Verevkin, 2000 | Based on data from 297. to 328. K.; AC |
15.8 | 350. | A | Stephenson and Malanowski, 1987 | Based on data from 335. to 487. K. See also Dykyj, 1972.; AC |
16.9 | 271. | N/A | de Kruif, Schaake, et al., 1982 | AC |
15.9 | 386. | N/A | Rose, Acciarri, et al., 1957 | Based on data from 371. to 452. K. See also Boublik, Fried, et al., 1984.; AC |
15.4 | 367. | I | Cramer, 1943 | AC |
Antoine Equation Parameters
log10(P) = A − (B / (T + C))
P = vapor pressure (atm)
T = temperature (K)
View plot Requires a JavaScript / HTML 5 canvas capable browser.
Temperature (K) | A | B | C | Reference | Comment |
---|---|---|---|---|---|
371.3 to 452.3 | 4.34282 | 1512.718 | -129.255 | Rose, Acciarri, et al., 1957 | Coefficents calculated by NIST from author's data. |

Reaction thermochemistry data

Data compiled by: John E. Bartmess
Individual Reactions
C6H11O2- + =
By formula: C6H11O2- + H+ = C6H12O2
Quantity | Value | Units | Method | Reference | Comment |
---|---|---|---|---|---|
ΔrH° | 346.1 ± 2.1 | kcal/mol | G+TS | Caldwell, Renneboog, et al., 1989 | gas phase |
ΔrH° | 345.8 ± 2.4 | kcal/mol | G+TS | McLuckey, Cameron, et al., 1981 | gas phase |
Quantity | Value | Units | Method | Reference | Comment |
ΔrG° | 339.1 ± 2.0 | kcal/mol | IMRE | Caldwell, Renneboog, et al., 1989 | gas phase |
ΔrG° | 338.8 ± 2.3 | kcal/mol | CIDC | McLuckey, Cameron, et al., 1981 | gas phase |

Gas phase ion energetics data

Data compiled as indicated in comments:
B - John E. Bartmess
LLK - Sharon G. Lias, Rhoda D. Levin, and Sherif A. Kafafi
Ionization energy determinations
IE (eV) | Method | Reference | Comment |
---|---|---|---|
≤10.12 | EI | Holmes, Fingas, et al., 1981 | LLK |
Appearance energy determinations
Ion | AE (eV) | Other Products | Method | Reference | Comment |
---|---|---|---|---|---|
C2H4O2+ | 10.52 ± 0.05 | C4H8 | EI | Holmes and Lossing, 1980 | LLK |
C2H402+ | 10.52 | 1-C4H8 | EI | Holmes and Lossing, 1980, 2 | LLK |
De-protonation reactions
C6H11O2- + =
By formula: C6H11O2- + H+ = C6H12O2
Quantity | Value | Units | Method | Reference | Comment |
---|---|---|---|---|---|
ΔrH° | 346.1 ± 2.1 | kcal/mol | G+TS | Caldwell, Renneboog, et al., 1989 | gas phase; B |
ΔrH° | 345.8 ± 2.4 | kcal/mol | G+TS | McLuckey, Cameron, et al., 1981 | gas phase; B |
Quantity | Value | Units | Method | Reference | Comment |
ΔrG° | 339.1 ± 2.0 | kcal/mol | IMRE | Caldwell, Renneboog, et al., 1989 | gas phase; B |
ΔrG° | 338.8 ± 2.3 | kcal/mol | CIDC | McLuckey, Cameron, et al., 1981 | gas phase; B |

Kovats' RI, non-polar column, temperature ramp

Column type | Active phase | I | Reference | Comment |
---|---|---|---|---|
Capillary | CP Sil 8 CB | 950. | Schwob, Bessiere, et al., 2004 | 30. m/0.25 mm/0.25 μm, H2, 50. C @ 2. min, 3. K/min; Tend: 220. C |
Capillary | DB-1 | 975. | Takeoka, Perrino, et al., 1996 | 60. m/0.25 mm/0.25 μm, 30. C @ 4. min, 2. K/min; Tend: 220. C |
Capillary | DB-1 | 981. | Takeoka, Perrino, et al., 1996 | 60. m/0.25 mm/0.25 μm, 30. C @ 4. min, 2. K/min; Tend: 220. C |

Kovats' RI, non-polar column, custom temperature program

Column type | Active phase | I | Reference | Comment |
---|---|---|---|---|
Capillary | BP-1 | 1010. | Khan, Verma, et al., 2006 | 30. m/0.32 mm/0.25 μm, N2; Program: 60C => 5C/min => 220C (5min) => 3C/min => 245C(5min) |

Kovats' RI, polar column, temperature ramp

Column type | Active phase | I | Reference | Comment |
---|---|---|---|---|
Capillary | BP-20 | 1857. | Khan, Verma, et al., 2006 | 30. m/0.32 mm/0.25 μm, N2, 5. K/min, 220. C @ 14. min; Tstart: 60. C |

Kovats' RI, polar column, custom temperature program

Column type | Active phase | I | Reference | Comment |
---|---|---|---|---|
Capillary | DB-Wax | 1849. | Rezende and Fraga, 2003 | 30. m/0.25 mm/0.25 μm, He; Program: 40C(5min) => 5C/min => 150C => 8C/min => 240C(25min) |

Van Den Dool and Kratz RI, non-polar column, temperature ramp

Column type | Active phase | I | Reference | Comment |
---|---|---|---|---|
Capillary | SPB-5 | 978. | Engel and Ratel, 2007 | 60. m/0.32 mm/1. μm, 40. C @ 2. min, 3. K/min, 230. C @ 10. min |
Capillary | HP-5 | 981. | Quijano, Salamanca, et al., 2007 | 30. m/0.25 mm/0.25 μm, He, 50. C @ 4. min, 4. K/min, 250. C @ 10. min |
Capillary | SE-54 | 1019. | Schlutt B., Moran N., et al., 2007 | He, 40. C @ 2. min, 8. K/min, 240. C @ 5. min; Column length: 50. m; Column diameter: 0.32 mm |
Capillary | DB-5 | 990. | Wu, Zorn, et al., 2007 | 30. m/0.32 mm/0.25 μm, He, 40. C @ 2. min, 5. K/min, 250. C @ 5. min |
Capillary | CP Sil 8 CB | 1019. | Mahadevan and Farmer, 2006 | 60. C @ 5. min, 4. K/min, 220. C @ 30. min; Column length: 50. m; Column diameter: 0.32 mm |
Capillary | DB-1 | 973. | Osorio, Alarcon, et al., 2006 | 25. m/0.2 mm/0.33 μm, 4. K/min; Tstart: 50. C; Tend: 300. C |
Capillary | DB-5MS | 1026. | Schwambach and Peterson, 2006 | 30. m/0.25 mm/0.25 μm, H2, 30. C @ 2. min, 2. K/min, 250. C @ 2. min |
Capillary | DB-5MS | 1008. | Whetstine M.E.C., Drake M.A., et al., 2006 | 30. m/0.25 mm/0.25 μm, He, 40. C @ 5. min, 5. K/min, 200. C @ 45. min |
Capillary | DB-5 | 1020. | Colahan-Sederstrom and Peterson, 2005 | 30. m/0.25 mm/0.25 μm, N2, 40. C @ 2. min, 5. K/min, 230. C @ 6. min |
Capillary | 5 % Phenyl methyl siloxane | 981. | Estevez, Ventanas, et al., 2005 | 30. m/0.25 mm/1. μm, He, 40. C @ 10. min, 7. K/min, 250. C @ 5. min |
Capillary | HP-5MS | 981. | Pino, Mesa, et al., 2005 | 30. m/0.25 mm/0.25 μm, He, 60. C @ 2. min, 4. K/min, 250. C @ 20. min |
Capillary | DB-5MS | 1019. | Whetstine, Cadwallader, et al., 2005 | 30. m/0.25 mm/0.25 μm, 40. C @ 3. min, 10. K/min, 200. C @ 20. min |
Capillary | DB-5 | 990. | Wu, Zorn, et al., 2005 | 30. m/0.32 mm/0.25 μm, He, 40. C @ 2. min, 5. K/min, 250. C @ 5. min |
Capillary | DB-5 | 1036. | Avsar, Karagul-Yuceer, et al., 2004 | 30. m/0.25 mm/0.25 μm, 40. C @ 5. min, 10. K/min, 200. C @ 15. min |
Capillary | SPB-5 | 993. | Píno, Marbot, et al., 2004 | 30. m/0.25 mm/0.25 μm, He, 60. C @ 2. min, 4. K/min, 250. C @ 20. min |
Capillary | DB-5MS | 1020. | Karagül-Yüceer, Vlahovich, et al., 2003 | 30. m/0.25 mm/0.25 μm, He, 35. C @ 5. min, 10. K/min, 200. C @ 30. min |
Capillary | HP-5MS | 977. | Lalel, Singh, et al., 2003 | 60. m/0.25 mm/0.25 μm, He, 40. C @ 1. min, 3. K/min, 310. C @ 20. min |
Capillary | DB-5 | 997. | Peterson and Reineccius, 2003 | 30. m/0.25 mm/0.25 μm, 35. C @ 2. min, 4. K/min, 250. C @ 4. min |
Capillary | DB-5 | 997. | Peterson and Reineccius, 2003, 2 | 30. m/0.25 mm/0.25 μm, 35. C @ 2. min, 4. K/min, 250. C @ 4. min |
Capillary | SPB-5 | 993. | Pino, Marbot, et al., 2003 | 30. m/0.25 mm/0.25 μm, He, 60. C @ 2. min, 4. K/min, 250. C @ 20. min |
Capillary | DB-5 | 1014. | Karagül-Yüceer, Cadwallader, et al., 2002 | 30. m/0.32 mm/0.25 μm, 35. C @ 5. min, 10. K/min, 200. C @ 30. min |
Capillary | SPB-5 | 986. | Pino, Marbot, et al., 2002 | 30. m/0.25 mm/0.25 μm, He, 60. C @ 2. min, 4. K/min, 250. C @ 20. min |
Capillary | CP Sil 5 CB | 988. | Pino, Marbot, et al., 2002, 2 | 50. m/0.32 mm/0.4 μm, He, 60. C @ 10. min, 3. K/min, 280. C @ 60. min |
Capillary | DB-5 | 1008. | Karagül-Yüceer, Drake, et al., 2001 | 30. m/0.32 mm/0.25 μm, 35. C @ 5. min, 10. K/min, 200. C @ 30. min |
Capillary | SPB-1 | 951. | Larráyoz, Addis, et al., 2001 | 30. m/0.32 mm/4. μm, He, 45. C @ 13. min, 5. K/min, 240. C @ 5. min |
Capillary | DB-5 | 981. | Nogueira, Bittrich, et al., 2001 | 30. m/0.25 mm/0.25 μm, H2, 3. K/min; Tstart: 60. C; Tend: 240. C |
Capillary | CP Sil 5 CB | 956. | Pino and Marbot, 2001 | 50. m/0.32 mm/0.4 μm, He, 60. C @ 10. min, 3. K/min, 280. C @ 60. min |
Capillary | CP Sil 5 CB | 988. | Pino, Marbot, et al., 2001 | 50. m/0.32 mm/0.4 μm, He, 60. C @ 10. min, 3. K/min, 280. C @ 60. min |
Capillary | SE-54 | 1005.51 | Yin, Xiu, et al., 2001 | 35. C @ 3. min, 4. K/min, 230. C @ 10. min; Column length: 25. m; Column diameter: 0.31 mm |
Capillary | OV-1 | 996. | Valero, Sanz, et al., 1999 | 20. m/0.32 mm/0.3 μm, He, 45. C @ 5. min, 10. K/min, 220. C @ 10. min |
Capillary | SPB-5 | 969. | Verdier-Metz., Coulon, et al., 1998 | 60. m/0.32 mm/1. μm, He, 40. C @ 5. min, 3. K/min, 200. C @ 2. min |
Capillary | DB-5 | 959. | Sakho, Chassagne, et al., 1997 | H2, 60. C @ 3. min, 2. K/min; Column length: 30. m; Column diameter: 0.25 mm; Tend: 220. C |
Capillary | DB-1 | 982. | Wu, Kuo, et al., 1991 | 50. m/0.32 mm/1.05 μm, He, 2. K/min, 260. C @ 40. min; Tstart: 40. C |
Capillary | DB-1 | 948. | Zhang and Ho, 1989 | 60. m/0.25 mm/0.25 μm, He, 2. K/min, 220. C @ 10. min; Tstart: 40. C |
Capillary | CP Sil 5 CB | 967. | Hendriks and Bruins, 1983 | 4. K/min; Column length: 25. m; Column diameter: 0.22 mm; Tstart: 70. C; Tend: 205. C |

Van Den Dool and Kratz RI, non-polar column, custom temperature program

Column type | Active phase | I | Reference | Comment |
---|---|---|---|---|
Capillary | SE-54 | 1020. | Schuh and Schieberle, 2006 | 30. m/0.32 mm/0.25 μm; Program: 40C(2min) => 6C/min => 150C => 20C/min => 230C |
Capillary | DB-5 | 1006. | Wang, Finn, et al., 2005 | 30. m/0.32 mm/1. μm, He; Program: 40C(2min) => 5C/min => 100C => 4C/min => 230C (10min) |
Capillary | DB-5 | 984. | Passos X.S., Castro A.C.M., et al., 2003 | 30. m/0.25 mm/0.25 μm, He; Program: 60C(2min) => 3C/min => 240C => 10C/min => 270C (4.5min) |
Capillary | DB-1 | 962. | Place, Imhof, et al., 2003 | 60. m/0.32 mm/1. μm, He; Program: 35C(5min) => 10C/min => 45C (5min) => 5C/min => 250C (10min) |
Capillary | DB-5MS | 989. | Boulanger and Crouzet, 2001 | 30. m/0.25 mm/0.25 μm, H2; Program: 40C (5min) => 2C/min => 200C => 5C/min => 250C (15min) |
Capillary | DB-5MS | 977. | Boulanger and Crouzet, 2001 | 30. m/0.25 mm/0.25 μm, H2; Program: 40C (5min) => 2C/min => 200C => 5C/min => 250C (15min) |
Capillary | DB-5MS | 990. | Boulanger and Crouzet, 2000 | 30. m/0.25 mm/0.25 μm, He; Program: 60 0C (3 min) 2 K/min -> 220 0C 5 K/min -> 250 0C (15 min) |
Capillary | DB-1 | 983. | Peng, 2000 | 15. m/0.53 mm/1. μm, He; Program: 40C(3min) => 8C/min => 200(1min) => 5C/min => 300C(25min) |
Capillary | DB-5 | 1013. | Boulanger, Chassagne, et al., 1999 | 30. m/0.25 mm/0.25 μm, H2; Program: 40C(5min) => 2C/min => 220C => 5C/min => 250C(15min) |
Capillary | DB-5 | 970. | Boulanger, Chassagne, et al., 1999 | 30. m/0.25 mm/0.25 μm, H2; Program: 40C(5min) => 2C/min => 220C => 5C/min => 250C(15min) |
Capillary | SE-54 | 1019. | Tairu, Hofmann, et al., 1999 | 30. m/0.32 mm/0.25 μm, He; Program: 35C (2min) => 40C/min => 60C (2min) => 6C/min => 180C => 10C/min => 230C (5min) |
Capillary | SE-54 | 1019. | Tairu, Hofmann, et al., 1999, 2 | 30. m/0.32 mm/0.25 μm, He; Program: 35 0C 40 0C/min -> 60 0C (2 min) 6 0C/min -> 180 0C 10 0C/min -> 230 0C |
Capillary | Methyl Silicone | 992. | Peng, Yang, et al., 1991 | Program: not specified |
Packed | SE-30 | 992. | Peng, Ding, et al., 1988 | Supelcoport; Chromosorb; Column length: 3.05 m; Program: 40C(5min) => 10C/min => 200C or 250C (60min) |

Van Den Dool and Kratz RI, polar column, temperature ramp

Column type | Active phase | I | Reference | Comment |
---|---|---|---|---|
Capillary | DB-Wax | 1854. | Botelho, Caldeira, et al., 2007 | 30. m/0.25 mm/0.25 μm, He, 50. C @ 2. min, 3.5 K/min, 180. C @ 25. min |
Capillary | Innowax | 1863. | Botelho, Caldeira, et al., 2007 | 30. m/0.25 mm/0.25 μm, H2, 45. C @ 5. min, 3.5 K/min, 210. C @ 20. min |
Capillary | DB-FFAP | 1839. | Jarunrattanasri, Theerakulkait, et al., 2007 | 30. m/0.25 mm/0.5 μm, He, 35. C @ 5. min, 4. K/min, 225. C @ 30. min |
Capillary | DB-FFAP | 1839. | Jarunrattanasri, Theerakulkait, et al., 2007 | 30. m/0.25 mm/0.5 μm, He, 35. C @ 5. min, 4. K/min, 225. C @ 30. min |
Capillary | FFAP | 1824. | Lozano P.R., Drake M., et al., 2007 | 30. m/0.25 mm/0.25 μm, He, 35. C @ 5. min, 10. K/min, 225. C @ 25. min |
Capillary | FFAP | 1854. | Lozano P.R., Miracle E.R., et al., 2007 | 30. m/0.25 mm/0.25 μm, He, 35. C @ 5. min, 10. K/min, 225. C @ 25. min |
Capillary | DB-Wax | 1851. | Pozo-Bayon M.A., Ruiz-Rodriguez A., et al., 2007 | 30. m/0.25 mm/0.5 μm, He, 40. C @ 5. min, 4. K/min, 250. C @ 15. min |
Capillary | DB-Wax | 1866. | Pozo-Bayon M.A., Ruiz-Rodriguez A., et al., 2007 | 30. m/0.25 mm/0.5 μm, He, 40. C @ 5. min, 4. K/min, 250. C @ 15. min |
Capillary | DB-Wax | 1851. | Pozo-Bayon M.A., Ruiz-Rodriguez A., et al., 2007 | 30. m/0.25 mm/0.5 μm, He, 40. C @ 5. min, 4. K/min, 250. C @ 15. min |
Capillary | HP-Innowax | 1831. | Quijano, Linares, et al., 2007 | 60. m/0.25 mm/0.25 μm, He, 50. C @ 4. min, 4. K/min, 220. C @ 10. min |
Capillary | FFAP | 1830. | Schlutt B., Moran N., et al., 2007 | He, 40. C @ 2. min, 8. K/min, 240. C @ 5. min; Column length: 30. m; Column diameter: 0.32 mm |
Capillary | ZB-Wax | 1866. | Wu, Zorn, et al., 2007 | 30. m/0.32 mm/0.25 μm, He, 40. C @ 2. min, 5. K/min, 250. C @ 5. min |
Capillary | DB-Wax | 1861. | Gurbuz O., Rouseff J.M., et al., 2006 | 60. m/0.25 mm/0.25 μm, He, 7. K/min, 265. C @ 5. min; Tstart: 40. C |
Capillary | Innowax | 1838. | Lee, Lee, et al., 2006 | 60. m/0.25 mm/0.25 μm, He, 40. C @ 4. min, 4. K/min, 230. C @ 20. min |
Capillary | CP-Wax 52CB | 1838. | Mahadevan and Farmer, 2006 | 60. C @ 5. min, 4. K/min, 220. C @ 30. min; Column length: 50. m; Column diameter: 0.32 mm |
Capillary | DB-Wax | 1810. | Osorio, Alarcon, et al., 2006 | 30. m/0.25 mm/0.25 μm, He, 50. C @ 4. min, 4. K/min, 220. C @ 20. min |
Capillary | LM-120 | 1838. | Pinto, Guedes, et al., 2006 | 50. m/0.25 mm/0.5 μm, 3. K/min, 240. C @ 30. min; Tstart: 50. C |
Capillary | DB-FFAP | 1850. | Schwambach and Peterson, 2006 | 30. m/0.25 mm/0.25 μm, H2, 30. C @ 2. min, 3. K/min, 230. C @ 4. min |
Capillary | DB-Wax | 1854. | Whetstine M.E.C., Drake M.A., et al., 2006 | 30. m/0.25 mm/0.25 μm, He, 40. C @ 3. min, 10. K/min, 200. C @ 20. min |
Capillary | OV-351 | 1823. | Bonvehí, 2005 | 50. m/0.32 mm/0.2 μm, He, 5. K/min; Tstart: 60. C; Tend: 220. C |
Capillary | DB-Wax | 1850. | Carunchia Whetstine, Croissant, et al., 2005 | 30. m/0.25 mm/0.25 μm, 40. C @ 3. min, 10. K/min, 200. C @ 20. min |
Capillary | DB-FFAP | 1847. | Colahan-Sederstrom and Peterson, 2005 | 30. m/0.25 mm/0.25 μm, N2, 40. C @ 2. min, 5. K/min, 230. C @ 6. min |
Capillary | Stabilwax | 1848. | Cros, Lignot, et al., 2005 | 60. m/0.25 mm/0.25 μm, He, 40. C @ 5. min, 3. K/min, 240. C @ 10. min |
Capillary | Stabilwax | 1857. | Fang and Qian, 2005 | 30. m/0.32 mm/1. μm, N2, 40. C @ 2. min, 4. K/min, 230. C @ 10. min |
Capillary | DB-Wax | 1860. | Malliaa, Fernandez-Garcia, et al., 2005 | 60. m/0.32 mm/1. μm, He, 45. C @ 1. min, 5. K/min, 250. C @ 12. min |
Capillary | DB-Wax | 1863. | Malliaa, Fernandez-Garcia, et al., 2005 | 60. m/0.32 mm/1. μm, He, 45. C @ 1. min, 5. K/min, 250. C @ 12. min |
Capillary | Supelcowax-10 | 1843. | Riu-Aumatell, Lopez-Tamames, et al., 2005 | 30. m/0.25 mm/0.25 μm, He, 60. C @ 5. min, 3. K/min, 240. C @ 10. min |
Capillary | Carbowax 20M | 1813. | Verzera, Campisi, et al., 2005 | 60. m/0.25 mm/0.25 μm, He, 45. C @ 0.17 min, 2. K/min; Tend: 250. C |
Capillary | DB-Wax | 1861. | Whetstine, Cadwallader, et al., 2005 | 30. m/0.25 mm/0.25 μm, 40. C @ 3. min, 10. K/min, 200. C @ 20. min |
Capillary | ZB-Wax | 1860. | Wu, Zorn, et al., 2005 | 30. m/0.32 mm/0.25 μm, He, 40. C @ 2. min, 5. K/min, 250. C @ 5. min |
Capillary | DB-Wax | 1862. | Avsar, Karagul-Yuceer, et al., 2004 | 30. m/0.25 mm/0.25 μm, 40. C @ 5. min, 10. K/min, 200. C @ 15. min |
Capillary | DB-Wax | 1862. | Avsar, Karagul-Yuceer, et al., 2004 | 30. m/0.25 mm/0.25 μm, 40. C @ 5. min, 10. K/min, 200. C @ 15. min |
Capillary | ZB-Wax | 1862. | Ledauphin, Saint-Clair, et al., 2004 | 30. m/0.25 mm/0.15 μm, He, 35. C @ 10. min, 1.8 K/min, 220. C @ 10. min |
Capillary | DB-Wax | 1858. | Mahajan, Goddik, et al., 2004 | 30. m/0.25 mm/0.5 μm, He, 40. C @ 2. min, 5. K/min, 230. C @ 10. min |
Capillary | DB-Wax Etr | 1834. | Ménager, Jost, et al., 2004 | 30. m/0.25 mm/0.25 μm, He, 40. C @ 3. min, 3. K/min, 245. C @ 20. min |
Capillary | DB-Wax | 1816. | Nielsen, Larsen, et al., 2004 | 30. m/0.25 mm/0.25 μm, He, 45. C @ 10. min, 6. K/min, 240. C @ 30. min |
Capillary | DB-Wax | 1827. | Brat, Rega, et al., 2003 | 30. m/0.25 mm/0.25 μm, He, 3. K/min, 250. C @ 20. min; Tstart: 40. C |
Capillary | DB-Wax | 1823. | Chyau, Ko, et al., 2003 | 60. m/0.25 mm/0.25 μm, He, 2. K/min, 210. C @ 40. min; Tstart: 40. C |
Capillary | Stabilwax | 1848. | Cros, Vandanjon, et al., 2003 | 60. m/0.25 mm/0.25 μm, He, 40. C @ 5. min, 3. K/min, 240. C @ 10. min |
Capillary | DB-FFAP | 1840. | Karagül-Yüceer, Vlahovich, et al., 2003 | 30. m/0.25 mm/0.25 μm, He, 35. C @ 5. min, 10. K/min, 200. C @ 30. min |
Capillary | DB-Wax | 1825. | Mau, Ko, et al., 2003 | 60. m/0.25 mm/0.25 μm, N2, 2. K/min, 210. C @ 40. min; Tstart: 40. C |
Capillary | DB-Wax | 1854. | Peterson and Reineccius, 2003 | 30. m/0.25 mm/0.25 μm, 35. C @ 2. min, 6. K/min, 240. C @ 6. min |
Capillary | DB-Wax | 1873. | Rega, Fournier, et al., 2003 | 30. m/0.32 mm/0.5 μm, 35. C @ 5. min, 5. K/min, 240. C @ 5. min |
Capillary | ZB-Wax | 1803. | Brunton, Cronin, et al., 2002 | 60. m/0.32 mm/0.25 μm, He, 3. K/min; Tstart: 40. C; Tend: 220. C |
Capillary | DB-Wax | 1865. | Claudela, Dirningera, et al., 2002 | 60. m/0.32 mm/0.5 μm, He, 2.7 K/min, 235. C @ 30. min; Tstart: 67. C |
Capillary | DB-FFAP | 1830. | Karagül-Yüceer, Cadwallader, et al., 2002 | 30. m/0.25 mm/0.25 μm, 35. C @ 5. min, 10. K/min, 200. C @ 30. min |
Capillary | DB-FFAP | 1829. | Karagül-Yüceer, Cadwallader, et al., 2002 | 30. m/0.25 mm/0.25 μm, 35. C @ 5. min, 10. K/min, 200. C @ 30. min |
Capillary | AT-Wax | 1825. | Pino, Marbot, et al., 2002, 2 | 60. m/0.32 mm/0.25 μm, He, 65. C @ 10. min, 2. K/min, 250. C @ 60. min |
Capillary | DB-Wax | 1834. | Karagül-Yüceer, Drake, et al., 2001 | 30. m/0.25 mm/0.25 μm, 35. C @ 5. min, 10. K/min, 200. C @ 30. min |
Capillary | CP-Wax 52CB | 1816. | Liu, Yang, et al., 2001 | H2, 2. K/min; Column length: 50. m; Column diameter: 0.32 mm; Tstart: 50. C; Tend: 200. C |
Capillary | DB-Wax | 1849.3 | Pet'ka, Mocák, et al., 2001 | 30. m/0.32 mm/0.25 μm, H2, 35. C @ 0.5 min, 4. K/min; Tend: 220. C |
Capillary | AT-Wax | 1825. | Pino and Marbot, 2001 | 60. m/0.32 mm/0.25 μm, He, 65. C @ 10. min, 2. K/min, 250. C @ 60. min |
Capillary | AT-Wax | 1825. | Pino, Marbot, et al., 2001 | 60. m/0.32 mm/0.25 μm, He, 65. C @ 10. min, 2. K/min, 250. C @ 60. min |
Capillary | DB-Wax | 1852. | Shimoda, Yoshimura, et al., 2001 | 60. m/0.25 mm/0.25 μm, He, 2. K/min, 230. C @ 60. min; Tstart: 50. C |
Capillary | CP-Wax 52CB | 1813. | Verzera, Campisi, et al., 2001 | 60. m/0.25 mm/0.25 μm, He, 45. C @ 0.17 min, 2. K/min; Tend: 250. C |
Capillary | DB-FFAP | 1849. | Charles, Martin, et al., 2000 | 30. m/0.32 mm/0.25 μm, H2, 40. C @ 2. min, 5. K/min; Tend: 240. C |
Capillary | DB-Wax | 1852. | Moio, Piombino, et al., 2000 | 30. m/0.32 mm/1. μm, H2, 3. K/min; Tstart: 40. C; Tend: 210. C |
Capillary | DB-Wax | 1853. | Moio, Piombino, et al., 2000 | 30. m/0.32 mm/1. μm, H2, 3. K/min; Tstart: 40. C; Tend: 210. C |
Capillary | DB-Wax | 1889. | Peng, 2000 | 15. m/0.53 mm/1. μm, He, 40. C @ 3. min, 5. K/min, 220. C @ 30. min |
Capillary | FFAP | 1867. | Stephan and Steinhart, 1999 | 60. m/0.25 mm/0.5 μm, 50. C @ 3. min, 5. K/min, 230. C @ 15. min |
Capillary | DB-Wax | 1874. | Cha, Kim, et al., 1998 | 60. m/0.25 mm/0.25 μm, 40. C @ 5. min, 3. K/min, 200. C @ 60. min |
Capillary | DB-Wax | 1852. | Moio and Addeo, 1998 | 30. m/0.32 mm/1. μm, H2, 3. K/min; Tstart: 40. C; Tend: 210. C |
Capillary | DB-Wax | 1853. | Moio and Addeo, 1998 | 30. m/0.32 mm/1. μm, H2, 3. K/min; Tstart: 40. C; Tend: 210. C |
Capillary | DB-Wax | 1853. | Moio and Addeo, 1998 | 30. m/0.32 mm/1. μm, H2, 3. K/min; Tstart: 40. C; Tend: 210. C |
Capillary | DB-Wax | 1882. | Ott, Fay, et al., 1997 | 60. m/0.53 mm/1. μm, He, 20. C @ 5. min, 4. K/min, 200. C @ 10. min |
Capillary | DB-Wax | 1845. | Ott, Fay, et al., 1997 | 30. m/0.25 mm/0.25 μm, He, 20. C @ 5. min, 4. K/min, 200. C @ 10. min |
Capillary | DB-Wax | 1845. | Ott, Fay, et al., 1997 | 30. m/0.25 mm/0.25 μm, He, 20. C @ 5. min, 4. K/min, 200. C @ 10. min |
Capillary | DB-Wax | 1884.5 | Ott, Fay, et al., 1997 | 60. m/0.53 mm/1. μm, He, 20. C @ 5. min, 4. K/min, 200. C @ 10. min |
Capillary | PEG-20M | 1834. | Shimoda, Nakada, et al., 1997 | 60. m/0.25 mm/0.25 μm, He, 2. K/min, 230. C @ 60. min; Tstart: 50. C |
Capillary | DB-Wax | 1834. | Shimoda, Shiratsuchi, et al., 1996 | 60. m/0.25 mm/0.25 μm, He, 2. K/min, 230. C @ 60. min; Tstart: 50. C |
Capillary | DB-Wax | 1856. | Shimoda, Wu, et al., 1996 | 60. m/0.25 mm/0.25 μm, He, 3. K/min; Tstart: 50. C; Tend: 230. C |
Capillary | DB-Wax | 1833. | Shimoda, Shigematsu, et al., 1995 | 60. m/0.25 mm/0.25 μm, 2. K/min; Tstart: 50. C; Tend: 230. C |
Capillary | DB-Wax | 1833. | Shimoda, Shigematsu, et al., 1995, 2 | 60. m/0.25 mm/0.25 μm, He, 2. K/min; Tstart: 50. C; Tend: 230. C |
Capillary | DB-Wax | 1844. | Iwaoka, Hagi, et al., 1994 | He, 40. C @ 5. min, 2. K/min; Column length: 30. m; Column diameter: 0.25 mm; Tend: 200. C |
Capillary | DB-Wax | 1855. | Shiratsuchi, Shimoda, et al., 1994 | 60. m/0.25 mm/0.25 μm, He, 2. K/min, 230. C @ 60. min; Tstart: 50. C |
Capillary | DB-Wax | 1851. | Shiratsuchi, Shimoda, et al., 1993 | 60. m/0.25 mm/0.25 μm, 50. C @ 4. min, 2. K/min, 230. C @ 30. min |
Capillary | DB-Wax | 1841. | Umano, Hagi, et al., 1992 | He, 40. C @ 10. min, 2. K/min; Column length: 30. m; Column diameter: 0.25 mm; Tend: 200. C |
Capillary | DB-Wax | 1840. | Krammer, Winterhalter, et al., 1991 | 30. m/0.25 mm/0.25 μm, He, 50. C @ 3. min, 4. K/min; Tend: 240. C |
Capillary | CP-Wax 58CB | 1819. | Pabst, Barron, et al., 1991 | 30. m/0.25 mm/0.22 μm, He, 3. K/min; Tstart: 40. C; Tend: 220. C |
Packed | Carbowax 20M | 1834. | Peng, Yang, et al., 1991 | Supelcoport, 40. C @ 4. min, 8. K/min; Column length: 3.05 m; Tend: 200. C |
Capillary | DB-Wax | 1822. | Fröhlich, Duque, et al., 1989 | 30. m/0.25 mm/0.25 μm, He, 50. C @ 3. min, 4. K/min; Tend: 250. C |
Capillary | DB-Wax | 1823. | Fröhlich, Duque, et al., 1989 | 30. m/0.25 mm/0.25 μm, He, 50. C @ 3. min, 4. K/min; Tend: 250. C |
Capillary | Carbowax 20M | 1831. | Chen, Kuo, et al., 1986 | He, 50. C @ 5. min, 2. K/min, 200. C @ 40. min; Column length: 50. m; Column diameter: 0.32 mm |

Van Den Dool and Kratz RI, polar column, custom temperature program

Column type | Active phase | I | Reference | Comment |
---|---|---|---|---|
Capillary | CP-Wax 52CB | 1841. | Romeo, Ziino, et al., 2007 | 60. m/0.25 mm/0.25 μm, He; Program: 45C(5min) => 10C/min => 80C => 2C/min => 240C |
Capillary | Stabilwax | 1865. | Natali N., Chinnici F., et al., 2006 | 30. m/0.25 mm/0.25 μm, He; Program: 40C => 3C/min => 100C => 5C/min => 240C(10min) |
Capillary | FFAP | 1840. | Schuh and Schieberle, 2006 | 30. m/0.32 mm/0.25 μm; Program: 40C(2min) => 6C/min => 150C => 20C/min => 230C |
Capillary | DB-Wax | 1838. | Selli, Canbas, et al., 2006 | 30. m/0.32 mm/0.5 μm, H2; Program: 60C(3min) => 2C/min => 220C => 3C/min => 245C (20min) |
Capillary | DB-Wax | 1858. | Selli, Canbas, et al., 2006, 2 | 30. m/0.32 mm/0.5 μm, H2; Program: 60C(3min) => 2C/min => 220C => 3C/min => 245C(20min) |
Capillary | FFAP | 1844. | Fritsch and Schieberle, 2005 | 30. m/0.32 mm/0.25 μm, He; Program: 35C(2min) => 40C/min => 60C(2min) => 6C/min => 180C => 20C/min => 230C(10min) |
Capillary | Stabilwax | 1866. | Wang, Finn, et al., 2005 | 30. m/0.32 mm/1. μm, He; Program: 40C(2min) => 5C/min => 100C => 4C/min => 230C (10min) |
Capillary | Stabilwax | 1884. | Wang, Finn, et al., 2005 | 30. m/0.32 mm/1. μm, He; Program: 40C(2min) => 5C/min => 100C => 4C/min => 230C (10min) |
Capillary | DB-Wax | 1840. | Ferrari, Lablanquie, et al., 2004 | 60. m/0.25 mm/0.25 μm, He; Program: 35C(0.7min) => 20C/min => 70C => 4C/min => 240C |
Capillary | DB-Wax | 1838. | Selli, Cabaroglu, et al., 2004 | 30. m/0.32 mm/0.5 μm, H2; Program: 60C(3min) => 2C/min => 220C => 3C/min => 245C (20min) |
Capillary | CP-Wax 52CB | 1851. | Verzera, Ziino, et al., 2004 | 60. m/0.25 mm/0.25 μm, He; Program: 45C(5min) => 10C/min => 80C => 2C/min => 240C |
Capillary | Carbowax 20M | 1845. | Boido, Lloret, et al., 2003 | 25. m/0.32 mm/0.25 μm, H2; Program: 40C (8min) => 3C/min => 180C => 20C/min => 230C |
Capillary | Stabilwax | 1868. | Klesk and Qian, 2003 | 30. m/0.32 mm/1. μm, He; Program: 40C(2min) => 5C/min => 100C => 4C/min => 230C(10min) |
Capillary | Supelcowax-10 | 1849. | da Porto, Pizzale, et al., 2003 | 30. m/0.32 mm/0.3 μm; Program: 60C(8min) => 8C/min => 170C => 13C/min => 240C(20min) |
Capillary | DB-Wax | 1838. | Nurgel, Erten, et al., 2002 | 30. m/0.32 mm/0.5 μm, H2; Program: 60C (3min) => 2C/min => 220C => 3C/min => 245C (20min) |
Capillary | DB-FFAP | 1846. | Zehentbauer and Reineccius, 2002 | 30. m/0.25 mm/0.25 μm, He; Program: 35 0C (2 min) 40 K/min -> 60 0C (2 min) 6 K/min -> 230 0C |
Capillary | DB-Wax | 1836. | Boulanger and Crouzet, 2001 | 30. m/0.25 mm/0.25 μm, H2; Program: 60C (3min) => 2C/min => 220C => 5C/min => 250C (15min) |
Capillary | DB-Wax | 1832. | Boulanger and Crouzet, 2001 | 30. m/0.25 mm/0.25 μm, H2; Program: 60C (3min) => 2C/min => 220C => 5C/min => 250C (15min) |
Capillary | DB-Wax | 1828. | Cantergiani, Brevard, et al., 2001 | 30. m/0.25 mm/0.25 μm; Program: 20C(30s) => fast => 60C => 4C/min => 220C (20min) |
Capillary | FFAP | 1835. | Kirchhoff and Schieberle, 2001 | 30. m/0.32 mm/0.25 μm, He; Program: 40C(2min) => 40C/min => 60C(2min) => 6C/min => 240C(10min) |
Capillary | DB-FFAP | 1841. | Rychlik and Bosset, 2001 | 30. m/0.32 mm/0.25 μm, He; Program: 35C(2min) => 40C/min => 60C (2min) => 5C/min => 240C |
Capillary | DB-Wax | 1851. | Ziegleder, 2001 | He; Column length: 60. m; Column diameter: 0.25 mm; Program: 45C(4min) => 30C/min => 60C (5min) => 3C/min => 220C (40min) |
Capillary | DB-Wax | 1832. | Boulanger and Crouzet, 2000 | 30. m/0.25 mm/0.25 μm, H2; Program: 60 0C (3 min) 2 K/min -> 220 0C 5 K/min -> 250 0C (15 min) |
Capillary | DB-FFAP | 1817. | Munk, Munch, et al., 2000 | 30. m/0.32 mm/0.25 μm; Program: 40C(2min) => 40C/min => 60C (2min) => 6C/min => 180C => 10C/min => 240C (5min) |
Capillary | DB-FFAP | 1814. | Munk, Munch, et al., 2000 | 30. m/0.32 mm/0.25 μm; Program: 40C(2min) => 40C/min => 60C (2min) => 6C/min => 180C => 10C/min => 240C (5min) |
Capillary | FFAP | 1837. | Tairu, Hofmann, et al., 1999 | 30. m/0.32 mm/0.25 μm, He; Program: 35C (2min) => 40C/min => 60C (2min) => 6C/min => 180C => 10C/min => 230C (5min) |
Capillary | FFAP | 1850. | Kubícková and Grosch, 1997 | 30. m/0.32 mm/0.25 μm; Program: 35C (2min) => 40C/min => 60C (2min) => 6C/min => 230C (10min) |
Capillary | FFAP | 1860. | Yasuhara, 1987 | 50. m/0.25 mm/0.25 μm, He; Program: 20C (5min) => 2C/min => 70C => 4C/min => 210C |

Normal alkane RI, non-polar column, temperature ramp

Column type | Active phase | I | Reference | Comment |
---|---|---|---|---|
Capillary | HP-5 MS | 999. | Fanaro, Duarte, et al., 2012 | 30. m/0.25 mm/0.25 μm, Helium, 50. C @ 0.5 min, 5. K/min, 250. C @ 0.5 min |
Capillary | DB-5 | 952. | Cais-Sokolinska, Majcher, et al., 2011 | 25. m/0.20 mm/0.33 μm, Helium, 50. C @ 1. min, 20. K/min; Tend: 240. C |
Capillary | VF-5 MS | 995. | Leffingwell and Alford, 2011 | 60. m/0.32 mm/0.25 μm, Helium, 2. K/min, 260. C @ 28. min; Tstart: 30. C |
Capillary | VF-5 MS | 996. | Leffingwell and Alford, 2011 | 60. m/0.32 mm/0.25 μm, Helium, 2. K/min, 260. C @ 28. min; Tstart: 30. C |
Capillary | VF-5 MS | 982. | Liu, Lu, et al., 2011 | 30. m/0.25 mm/0.25 μm, Helium, 40. C @ 3. min, 5. K/min, 250. C @ 3. min |
Capillary | HP-5 MS | 974. | Jerkovic, Hegic, et al., 2010 | 30. m/0.25 mm/0.25 μm, Helium, 70. C @ 2. min, 3. K/min, 200. C @ 18. min |
Capillary | HP-5 MS | 974. | Jerkovic and Marijanovic, 2010 | 30. m/0.25 mm/0.25 μm, Helium, 70. C @ 2. min, 3. K/min, 200. C @ 18. min |
Capillary | DB-5 MS | 987. | Majcher, Lawrowski, et al., 2010 | 25. m/0.20 mm/0.33 μm, Helium, 40. C @ 1. min, 10. K/min; Tend: 250. C |
Capillary | HP-5 MS | 982. | Pino, Marquez, et al., 2010 | 30. m/0.32 mm/0.25 μm, Helium, 50. C @ 2. min, 4. K/min, 240. C @ 10. min |
Capillary | HP-5 MS | 971. | Radulovic, Blagojevic, et al., 2010 | 30. m/0.25 mm/0.25 μm, Helium, 5. K/min, 290. C @ 10. min; Tstart: 70. C |
Capillary | HP-5 MS | 961. | Radulovic, Dordevic, et al., 2010 | 30. m/0.25 mm/0.25 μm, Helium, 5. K/min, 290. C @ 10. min; Tstart: 70. C |
Capillary | DB-5 | 1022. | Mallia, Escher, et al., 2009 | 60. m/0.32 mm/0.25 μm, Helium, 6. K/min, 240. C @ 5. min |
Capillary | HP-5 MS | 970. | Radulovic, Blagojevic, et al., 2009 | 30. m/0.25 mm/0.25 μm, Helium, 5. K/min, 290. C @ 10. min; Tstart: 70. C |
Capillary | HP-5 MS | 1000. | Forero, Quijano, et al., 2008 | 30. m/0.25 mm/0.25 μm, Helium, 50. C @ 4. min, 4. K/min, 230. C @ 10. min |
Capillary | HP-5 | 1001. | Mildner-Szkudlarz and Jelen, 2008 | 10. m/0.10 mm/0.40 μm, Helium, 40. C @ 1. min, 20. K/min, 280. C @ 1. min |
Capillary | HP-5 | 1020. | Saidana, Mahjoub, et al., 2008 | 30. m/0.25 mm/0.25 μm, Nitrogen, 50. C @ 1. min, 5. K/min, 280. C @ 1. min |
Capillary | HP-5 MS | 998. | Thakeow, Angeli, et al., 2008 | 30. m/0.25 mm/0.25 μm, Helium, 50. C @ 1.5 min, 6.5 K/min, 250. C @ 10. min |
Capillary | HP-101 | 978. | Jerkovic, Mastelic, et al., 2007 | 25. m/0.2 mm/0.2 μm, He, 70. C @ 2. min, 3. K/min; Tend: 200. C |
Capillary | 5 % Phenyl methyl siloxane | 970. | Ramirez R. and Cava R., 2007 | 30. m/0.25 mm/1. μm, He, 40. C @ 10. min, 7. K/min, 250. C @ 5. min |
Capillary | 5 % Phenyl methyl siloxane | 970. | Ramirez R. and Cava R., 2007 | 30. m/0.25 mm/1. μm, He, 40. C @ 10. min, 7. K/min, 250. C @ 5. min |
Capillary | RTX-5 | 1025. | Setkova, Risticevic, et al., 2007 | 10. m/0.18 mm/0.2 μm, He, 40. C @ 0.5 min, 50. K/min, 275. C @ 0.5 min |
Capillary | DB-5 | 1020. | Xu, Fan, et al., 2007 | 30. m/0.32 mm/0.25 μm, He, 40. C @ 2. min, 4. K/min, 250. C @ 5. min |
Capillary | DB-1 | 1006. | Chen, Sheu, et al., 2006 | Nitrogen, 40. C @ 1. min, 2. K/min, 200. C @ 9. min; Column length: 60. m; Column diameter: 0.25 mm |
Capillary | DB-5 | 989. | Shen X., Gao Y., et al., 2006 | 30. m/0.25 mm/0.25 μm, He, 40. C @ 2. min, 4. K/min, 250. C @ 10. min |
Capillary | HP-5MS | 980. | Tzakou, Said, et al., 2006 | 30. m/0.25 mm/0.25 μm, He, 3. K/min; Tstart: 60. C; Tend: 280. C |
Capillary | Polymethylsiloxane, (PMS-20000) | 1011. | Dohou, Yamni, et al., 2005 | He, 50. C @ 3. min, 3. K/min; Column length: 25. m; Column diameter: 0.20 mm; Tend: 250. C |
Capillary | HP-5MS | 970. | Krist, Stuebiger, et al., 2005 | 30. m/0.25 mm/0.25 μm, 38. C @ 1. min, 5. K/min, 220. C @ 2. min |
Capillary | MDN-5 | 987. | van Loon, Linssen, et al., 2005 | 60. m/0.25 mm/0.25 μm, He, 40. C @ 4. min, 4. K/min, 270. C @ 5. min |
Capillary | HP-5 | 964. | N/A | 30. m/0.32 mm/0.25 μm, Helium, 40. C @ 2. min, 5. K/min, 250. C @ 5. min |
Capillary | HP-5 | 964. | N/A | 30. m/0.32 mm/0.25 μm, Helium, 40. C @ 2. min, 5. K/min, 250. C @ 5. min |
Capillary | HP-5 | 990. | N/A | 30. m/0.32 mm/0.25 μm, Helium, 40. C @ 2. min, 5. K/min, 250. C @ 5. min |
Capillary | HP-5 | 990. | N/A | 30. m/0.32 mm/0.25 μm, Helium, 40. C @ 2. min, 5. K/min, 250. C @ 5. min |
Capillary | HP-5 | 992. | N/A | 30. m/0.32 mm/0.25 μm, Helium, 40. C @ 2. min, 5. K/min, 250. C @ 5. min |
Capillary | 5 % Phenyl methyl siloxane | 970. | Ramírez, Estévez, et al., 2004 | 0. m/0.25 mm/1. μm, He, 40. C @ 10. min, 7. K/min, 250. C @ 5. min |
Capillary | SPB-5 | 980. | Ledauphin, Guichard, et al., 2003 | 30. m/0.32 mm/0.25 μm, He, 40. C @ 1. min, 5. K/min, 220. C @ 20. min |
Capillary | MDN-5 | 1009. | Mildner-Szkudlarz, Jelen, et al., 2003 | 30. m/0.25 mm/0.25 μm, He, 40. C @ 1. min, 20. K/min, 280. C @ 1. min |
Capillary | SPB-5 | 966. | Sebastian, Viallon-Fernandez, et al., 2003 | 60. m/0.32 mm/1.0 μm, Helium, 3. K/min; Tstart: 30. C; Tend: 230. C |
Capillary | RSL-200 | 971. | Jirovetz, Smith, et al., 2002 | 30. m/0.25 mm/0.25 μm, H2, 40. C @ 2. min, 6. K/min, 280. C @ 10. min |
Capillary | SPB-5 | 980. | Pino, Marbot, et al., 2002, 3 | 30. m/0.25 mm/0.25 μm, Helium, 60. C @ 2. min, 4. K/min, 250. C @ 20. min |
Capillary | RTX-5 | 1019. | Sies A., Hirsch R., et al., 2002 | 20. m/0.18 mm/0.4 μm, He, 20. C @ 3.5 min, 40. K/min, 290. C @ 0.5 min |
Capillary | Optima-1 | 1005. | Brun, Bessière, et al., 2001 | 25. m/0.20 mm/0.25 μm, He, 50. C @ 3. min, 3. K/min; Tend: 250. C |
Capillary | OV-101 | 1005. | Friedrich, Acree, et al., 2001 | 6. K/min; Column length: 15. m; Column diameter: 0.32 mm; Tstart: 35. C; Tend: 250. C |
Capillary | Optima-1 | 1008. | de Beck, Bessière, et al., 2000 | 25. m/0.20 mm/0.25 μm, He, 50. C @ 3. min, 3. K/min; Tend: 250. C |
Capillary | DB-5 | 1017. | Kotseridis and Baumes, 2000 | 30. m/0.32 mm/0.5 μm, H2, 60. C @ 3. min, 3. K/min, 245. C @ 20. min |
Capillary | DB-5 | 1017. | Kotseridis and Baumes, 2000 | 30. m/0.32 mm/0.5 μm, H2, 60. C @ 3. min, 3. K/min, 245. C @ 20. min |
Capillary | OV-101 | 966. | Tamura, Boonbumrung, et al., 2000 | Nitrogen, 40. C @ 10. min, 2. K/min; Column length: 50. m; Column diameter: 0.25 mm; Tend: 200. C |
Capillary | BP-5 | 1035. | Lopez, Ferreira, et al., 1999 | 50. m/0.32 mm/1. μm, He, 40. C @ 5. min, 2. K/min; Tend: 190. C |
Capillary | SPB-5 | 969. | Doneanu and Anitescu, 1998 | 50. m/0.32 mm/0.25 μm, He, 3. K/min, 240. C @ 20. min; Tstart: 60. C |
Capillary | Optima 1 | 995. | Fons, Rapior, et al., 1998 | 25. m/0.20 mm/0.25 μm, Helium, 3. K/min; Tstart: 50. C; Tend: 200. C |
Capillary | HP-1 | 1005. | Ong and Acree, 1998 | 4. K/min; Column length: 25. m; Column diameter: 0.32 mm; Tstart: 35. C; Tend: 250. C |
Capillary | HP-1 | 1005. | Ong, Acree, et al., 1998 | 4. K/min; Column length: 25. m; Column diameter: 0.32 mm; Tstart: 35. C; Tend: 250. C |
Capillary | DB-1 | 975. | Buttery, Ling, et al., 1997 | 30. C @ 25. min, 4. K/min, 200. C @ 20. min; Column length: 60. m; Column diameter: 0.25 mm |
Capillary | Ultra-2 | 1007. | King, Matthews, et al., 1995 | 50. m/0.32 mm/0.52 μm, He, 40. C @ 3. min, 4. K/min, 250. C @ 30. min |
Capillary | Ultra-2 | 1005. | King, Hamilton, et al., 1993 | 50. m/0.32 mm/0.52 μm, He, 40. C @ 3. min, 4. K/min, 250. C @ 30. min |
Capillary | DB-1 | 975. | Buttery, Teranishi, et al., 1990 | He, 30. C @ 25. min, 4. K/min, 200. C @ 5. min; Column length: 60. m; Column diameter: 0.25 mm |
Capillary | CP Sil 8 CB | 964. | Jantan and Goh, 1990 | 60. C @ 10. min, 3. K/min; Column length: 25. m; Column diameter: 0.20 mm; Tend: 230. C |
Capillary | DB-1 | 961. | Flath, Matsumoto, et al., 1989 | 60. m/0.32 mm/0.25 μm, 4. K/min; Tstart: 50. C; Tend: 250. C |
Capillary | DB-1 | 970. | Flath, Matsumoto, et al., 1989 | 60. m/0.32 mm/0.25 μm, 4. K/min; Tstart: 50. C; Tend: 250. C |
Capillary | DB-1 | 997. | Habu, Flath, et al., 1985 | 3. K/min; Column length: 50. m; Column diameter: 0.32 mm; Tstart: 0. C; Tend: 250. C |

Normal alkane RI, non-polar column, custom temperature program

Column type | Active phase | I | Reference | Comment |
---|---|---|---|---|
Capillary | DB-1 | 968. | Albano, Lima, et al., 2012 | 30. m/0.25 mm/0.25 μm, Hydrogen; Program: 45 0C 3 0C/min -> 175 0C 15 0C/min -> 300 0C (10 min) |
Capillary | CP-Sil 5 CB | 957. | Collin, Nizet, et al., 2012 | 50. m/0.32 mm/1.20 μm, Nitrogen; Program: 36 0C 20 0C/min -> 85 0C 1 0C/min -> 145 0C 3 0C/min -> 250 0C (30 min) |
Capillary | CP-Sil 5 CB | 950. | Collin, Nizet, et al., 2012, 2 | 50. m/0.32 mm/1.20 μm, Nitrogen; Program: 36 0C 20 0C/min -> 85 0C 1 0C/min -> 145 0C 3 0C/min -> 250 0C |
Capillary | SLB-5 MS | 979. | Mondello, 2012 | 30. m/0.25 mm/0.25 μm, Helium; Program: not specified |
Capillary | SLB-5 MS | 982. | Mondello, 2012 | 30. m/0.25 mm/0.25 μm, Helium; Program: not specified |
Capillary | Siloxane, 5 % Ph | 972. | VOC BinBase, 2012 | Program: not specified |
Capillary | VF-5 MS | 981. | Liu, Lu, et al., 2011 | 30. m/0.25 mm/0.25 μm, Helium; Program: not specified |
Capillary | DB-5 | 965. | Miyazaki, Plotto, et al., 2011 | 60. m/0.25 mm/1.00 μm, Helium; Program: 40 0C 4 0C/min -> 230 0C 100 0C/min -> 260 0C (11.7 min) |
Capillary | Polydimethyl siloxane, 5 % phenyl | 972. | Skogerson, Wohlgemuth, et al., 2011 | Program: not specified |
Capillary | ZB-1 MS | 974. | Al-Reza, Rahman, et al., 2010 | 30. m/0.25 mm/0.25 μm, Helium; Program: 50 0C 3 0C/min -> 150 0C (10 min) 10 0C/min -> 250 0C |
Capillary | HP-5 MS | 981. | Pino, Marquez, et al., 2010 | 30. m/0.32 mm/0.25 μm, Helium; Program: not specified |
Capillary | HP-5 MS | 1013. | Fan, Lu, et al., 2009 | 30. m/0.25 mm/0.25 μm, Helium; Program: 40 0C (3 min) 3 0C/min -> 160 0C (2 min) 8 0C/min -> 220 0C (3 min) |
Capillary | RTX-5 MS | 1017. | Mebazaa, Mahmoudi, et al., 2009 | 30. m/0.25 mm/0.25 μm, Helium; Program: 50 0C (5 min) 2 0C/min -> 100 0C (5 min) 5 0C/min -> 300 0C |
Capillary | RTX-5 MS | 1019. | Mebazaa, Mahmoudi, et al., 2009 | 30. m/0.25 mm/0.25 μm, Helium; Program: not specified |
Capillary | HP-5 | 974. | Pugliese, Sirtori, et al., 2009 | 50. m/0.32 mm/1.05 μm, Helium; Program: not specified |
Capillary | DB-1 | 999. | Nogueira, Marcelo-Curto, et al., 2008 | 30. m/0.25 mm/0.25 μm, He; Program: 45C => 3C/min => 175C => 15C/min => 300C (10min) |
Capillary | HP-5 | 970. | Ventanas, Estevez, et al., 2008 | 50. m/0.32 mm/1.05 μm, Helium; Program: 40 0C (10 min) 5 0C/min -> 200 0C 15 0C/min -> 250 0C (10 min) |
Capillary | HP-5 | 1029. | Zhao, Li, et al., 2008 | 30. m/0.25 mm/0.25 μm; Program: 40 0C (2 min) 5 0C/min -> 80 0C 7 oC/min -> 160 0C 9 0C/min -> 200 0C 20 0C/min -> 280 0C (10 min) |
Capillary | HP-5 | 1037. | Zhao, Li, et al., 2008 | 30. m/0.25 mm/0.25 μm; Program: not specified |
Capillary | SPB-1 | 958. | Borse, Rao, et al., 2007 | 30. m/0.25 mm/0.25 μm, Helium; Program: 35 0C (2 min) 1 0C/min -> 90 0C 3 0C/min -> 220 0C |
Capillary | SPB-1 | 1007. | Bosch-Fuste, Riu-Aumatell, et al., 2007 | 30. m/0.25 mm/0.25 μm, He; Program: 40C(10min) => 2C/min => 200C(1min) => 2C/min => 250C (10min) |
Capillary | DB-5 MS | 976. | Liu, Xu, et al., 2007 | 60. m/0.32 mm/1.0 μm, Helium; Program: 40 0C (2 min) 6 0C/min -> 100 0C 4 0C/min -> 180 0C 8 0C/min -> 250 0C (12 min) |
Capillary | HP-5MS | 997. | Mallia, Escher, et al., 2007 | Program: not specified |
Capillary | DB-5 | 1038. | Nivinsliene, Butkiene, et al., 2007 | 50. m/0.32 mm/0.25 μm, Helium; Program: 60 0C (1 min) 5 0C/min -> 160 0C 10 0C/min -> 250 0C |
Capillary | DB-5 | 1013. | Pellicer, 2007 | 30. m/0.32 mm/0.25 μm, Helium; Program: not specified |
Capillary | DB-5 | 991. | Pellicer, 2007 | 30. m/0.32 mm/0.25 μm, Helium; Program: not specified |
Capillary | HP-5MS | 1020. | Alissandrakis, Kibaris, et al., 2005 | 30. m/0.25 mm/0.25 μm, He; Program: 40C(3min) => 2C/min => 180C => 10C/min => 250C(5min) |
Capillary | DB-5 | 1003. | Hamm, Bleton, et al., 2005 | 30. m/0.25 mm/0.25 μm, He; Program: 40C(1min) => 9C/min => 130C => 2C/min => 230C |
Capillary | HP-5 | 1019. | Riu-Aumatell, Lopez-Tamames, et al., 2005 | Program: not specified |
Capillary | MFE-73 | 1020. | Escudero, Gogorza, et al., 2004 | Program: not specified |
Capillary | HP-5 | 976. | Garcia-Estaban, Ansorena, et al., 2004 | 50. m/0.32 mm/1.05 μm; Program: 40C(10min) => 5C/min => 200C => 20C/min => 250C(5min) |
Capillary | DB-5 | 976. | Garcia-Estaban, Ansorena, et al., 2004, 2 | 50. m/0.32 mm/1.05 μm; Program: 40C(10min) => 5C/min => 200C => 20C/min => 250C (5min) |
Capillary | SE-30 | 1000. | Vinogradov, 2004 | Program: not specified |
Capillary | DB-1 | 1013. | Alves and Franco, 2003 | 30. m/0.25 mm/0.25 μm, H2; Program: 40C(10min) => 2C/min => 110C => 5C/min => 200C(10min) |
Capillary | SPB-5 | 966. | Begnaud, Pérès, et al., 2003 | 60. m/0.32 mm/1. μm; Program: not specified |
Capillary | HP-5 | 984. | Demyttenaere, Dagher, et al., 2003 | 30. m/0.25 mm/0.25 μm, He; Program: 40C(1min) => 5C/min => 180C => 10C/min => 220C(2min) |
Capillary | HP-5 | 1037. | Jordán, Margaría, et al., 2003 | 30. m/0.25 mm/0.25 μm; Program: 40C(6min) => 2.5C/min => 150C => 90C/min => 250C |
Capillary | BPX-5 | 986. | Machiels, van Ruth, et al., 2003 | 60. m/0.32 mm/1. μm, He; Program: 40C (4min) => 2C/min => 90C => 4C/min => 130C => 8C/min => 250 C (10min) |
Capillary | HP-5MS | 984. | Demyttenaere, Dagher, et al., 2002 | 30. m/0.25 mm/0.25 μm, He; Program: 40C(1min) => 5C/min => 220C => 10C/min => 240C(2min) |
Capillary | MFE-73 | 1020. | Ferreira, Ortín, et al., 2002 | H2; Program: not specified |
Capillary | HP-5 | 970. | Jordán, Goodner, et al., 2002 | 30. m/0.25 mm/0.25 μm; Program: not specified |
Capillary | HP-5 | 1036. | Jordán, Goodner, et al., 2002 | 30. m/0.25 mm/0.25 μm; Program: not specified |
Capillary | HP-5MS | 1001. | Ansorena, Gimeno, et al., 2001 | 30. m/0.25 mm/0.25 μm, He; Program: 40C (10min) => 3C/min => 120C => 10C/min => 250C (5min) |
Capillary | MFE-73 | 1020. | Aznar, López, et al., 2001 | 30. m/0.32 mm/0.1 μm, H2; Program: 40C(5min) => 2C/min => 120C => 10C/min => 210C(30min) |
Capillary | MFE-73 | 1020. | Ferreira, Aznar, et al., 2001 | 30. m/0.32 mm/0.1 μm, H2; Program: 40 C (5min) => 2C/min => 120C => 10 C/min => 210 C (30min) |
Capillary | HP-1 | 983. | Teai, Claude-Lafontaine, et al., 2001 | 50. m/0.32 mm/0.52 μm, N2; Program: 40C => 2C/min => 130C => 4C/min => 250C |
Capillary | HP-5 | 999. | Ansorena, Astiasarán, et al., 2000 | 30. m/0.25 mm/0.25 μm, He; Program: 40C (10min) => 3C/min => 120C => 10C/min => 250C (5min) |
Capillary | CP Sil 5 CB | 965. | Guyot, Bouseta, et al., 1998 | 50. m/0.32 mm/1.2 μm, He; Program: 30C => 55C/min => 85C => 1C/min => 145C => 3C/min => 250C |
Capillary | SF-96 | 1007. | Kawasaki, Matsui, et al., 1998 | Column length: 40. m; Column diameter: 0.28 mm; Program: 75C => 3C/min => 190C(25min) => 3C/min => 210C |
Capillary | DB-5 | 1018. | Matsui, Guth, et al., 1998 | 30. m/0.32 mm/0.25 μm, He; Program: 35C(1min) => 40C/min => 60C (1min) => 6C/min => 230C |
Capillary | HP-5 | 981. | Timón, Ventanas, et al., 1998 | 50. m/0.32 mm/0.52 μm, He; Program: 35 0C 10 0C/min -> 200 0C (20 min) 5 0C/min -> 230 0C (50 min) |
Capillary | SE-54 | 1019. | Schermann and Schieberle, 1997 | 30. m/0.32 mm/0.25 μm, He; Program: 35C (2min) => 40C/min => 60C (2min) => 6C/min => 180C => 10C/min => 240C |
Capillary | RSL-150 | 964. | Buchbauer, Nikiforov, et al., 1994 | 60. m/0.32 mm/0.25 μm, He; Program: 30c (1.5min) => 20C/min => 55C => 6C/min => 200C(10min) |
Capillary | DB-1 | 981. | Ciccioli, Cecinato, et al., 1994 | 60. m/0.32 mm/0.25 μm; Program: not specified |
Capillary | DB-1 | 981. | Ciccioli, Brancaleoni, et al., 1993 | 60. m/0.32 mm/0.25 μm; Program: 3 min at 5 C; 5 - 50 C at 3 deg/min; 50 - 220 C at 5 deg/min |
Capillary | SE-54 | 986. | Um, Bailey, et al., 1992 | He; Column length: 50. m; Column diameter: 0.32 mm; Program: 35 0C (5 min) 8 0C/min -> 200 0C 2 0C/min -> 250 0C |
Capillary | SE-54 | 1000. | Suzuki and Bailey, 1985 | Column length: 50. m; Column diameter: 0.32 mm; Program: 35C(5min) => 8C/min => 200C => 2C/min => 250C |

Normal alkane RI, polar column, temperature ramp

Column type | Active phase | I | Reference | Comment |
---|---|---|---|---|
Capillary | HP-FFAP | 1864. | Wanakhachornkrai and Lertsiri, 9999 | 25. m/0.32 mm/0.50 μm, Helium, 15. K/min; Tstart: 45. C; Tend: 220. C |
Capillary | FFAP | 1824. | Piyachaiseth, Jirapakkul, et al., 2011 | 60. m/0.25 mm/0.25 μm, Helium, 45. C @ 1. min, 5. K/min, 220. C @ 5. min |
Capillary | VF-Wax MS | 1841. | Duarte, Dias, et al., 2010 | 60. m/0.25 mm/0.25 μm, Helium, 60. C @ 5. min, 3. K/min, 220. C @ 25. min |
Capillary | DB-Wax | 1842. | Kumazawa, Sakai, et al., 2010 | 30. m/0.25 mm/0.25 μm, Helium, 3. K/min; Tstart: 40. C; Tend: 210. C |
Capillary | DB-Wax | 1871. | Moon and Shibamoto, 2010 | 60. m/0.25 mm/0.50 μm, Helium, 40. C @ 5. min, 2. K/min, 210. C @ 70. min |
Capillary | CP Wax 52 CB | 1848. | Birtic, Ginies, et al., 2009 | 30. m/0.32 mm/0.50 μm, Helium, 40. C @ 2. min, 4. K/min, 230. C @ 15. min |
Capillary | DB-Wax | 1800. | Mallia, Escher, et al., 2009 | 30. m/0.32 mm/0.25 μm, Helium, 6. K/min, 240. C @ 5. min |
Capillary | CP-Wax | 1820. | Mo, Fan, et al., 2009 | 60. m/0.25 mm/0.25 μm, Helium, 50. C @ 2. min, 6. K/min, 230. C @ 15. min |
Capillary | HP-20M | 1860. | Blazevic and Mastelic, 2008 | 50. m/0.25 mm/0.25 μm, Helium, 70. C @ 4. min, 4. K/min; Tend: 180. C |
Capillary | HP-20M | 1875. | Blazevic and Mastelic, 2008 | 50. m/0.25 mm/0.25 μm, Helium, 70. C @ 4. min, 4. K/min; Tend: 180. C |
Capillary | DB-Wax | 1867. | Caldeira, de Sousa, et al., 2008 | 30. m/0.25 mm/0.25 μm, Helium, 40. C @ 10. min, 3.5 K/min, 180. C @ 30. min |
Capillary | DB-Wax | 1851. | Guo, Wu, et al., 2008 | 30. m/0.25 mm/0.25 μm, Helium, 60. C @ 2. min, 10. K/min, 250. C @ 10. min |
Capillary | HP-Innowax | 1862. | Soria, Sanz, et al., 2008 | 50. m/0.20 mm/0.20 μm, Helium, 45. C @ 2. min, 4. K/min, 190. C @ 50. min |
Capillary | HP-Innowax | 1843. | Thakeow, Angeli, et al., 2008 | 30. m/0.25 mm/0.25 μm, Helium, 50. C @ 1.5 min, 6.5 K/min, 250. C @ 10. min |
Capillary | CP-Wax 52CB | 1842. | Audino, Alzogaray, et al., 2007 | He, 50. C @ 2. min, 6. K/min, 220. C @ 20. min; Column length: 30. m; Phase thickness: 0.32 μm |
Capillary | Stabilwax | 1848. | Cros, Vandanjon, et al., 2007 | 60. m/0.25 mm/0.25 μm, Helium, 40. C @ 5. min, 3. K/min, 240. C @ 10. min |
Capillary | DB-Wax | 1870. | Dury-Brun, Fournier, et al., 2007 | 30. m/0.32 mm/0.5 μm, He, 5. K/min; Tstart: 40. C; Tend: 240. C |
Capillary | CP-Wax 52CB | 1845. | Povolo, Contarini, et al., 2007 | 60. m/0.32 mm/0.5 μm, He, 40. C @ 8. min, 4. K/min, 220. C @ 20. min |
Capillary | CP-Wax 52CB | 1846. | Povolo, Contarini, et al., 2007 | 60. m/0.32 mm/0.5 μm, He, 40. C @ 8. min, 4. K/min, 220. C @ 20. min |
Capillary | RTX-Wax | 1828. | Prososki, Etzel, et al., 2007 | 30. m/0.25 mm/0.5 μm, He, 40. C @ 5. min, 10. K/min, 220. C @ 10. min |
Capillary | BP-20 | 1864. | Rawat, Gulati, et al., 2007 | 30. m/0.25 mm/0.25 μm, He, 70. C @ 4. min, 4. K/min, 220. C @ 5. min |
Capillary | DB-Wax | 1846. | Xu, Fan, et al., 2007 | 30. m/0.25 mm/0.25 μm, He, 40. C @ 2. min, 4. K/min, 230. C @ 5. min |
Capillary | DB-Wax | 1846. | Xu, Fan, et al., 2007 | 30. m/0.25 mm/0.25 μm, He, 40. C @ 2. min, 4. K/min, 230. C @ 5. min |
Capillary | DB-Wax | 1846. | Fan and Qian, 2006 | 30. m/0.32 mm/0.25 μm, He, 40. C @ 2. min, 4. K/min, 230. C @ 15. min |
Capillary | DB-Wax | 1866. | Fan and Qian, 2006, 2 | 30. m/0.32 mm/0.25 μm, N2, 40. C @ 2. min, 6. K/min, 230. C @ 15. min |
Capillary | DB-Wax Etr | 1866. | Ibarz, Ferreira, et al., 2006 | 60. m/0.25 mm/0.25 μm, He, 40. C @ 5. min, 2. K/min, 230. C @ 100. min |
Capillary | DB-Wax | 1838. | Kishimoto, Wanikawa, et al., 2006 | 15. m/0.32 mm/0.25 μm, He, 6. K/min, 230. C @ 20. min; Tstart: 40. C |
Capillary | HP-Innowax | 1833. | Komes, Ulrich, et al., 2006 | 30. m/0.25 mm/0.5 μm, He, 40. C @ 3. min, 2. K/min, 200. C @ 15. min |
Capillary | DB-Wax Etr | 1882. | Perestrelo, Fernandes, et al., 2006 | 30. m/0.25 mm/0.25 μm, He, 40. C @ 1. min, 2. K/min, 220. C @ 10. min |
Capillary | ZB-Wax | 1866. | Wierda R.L., Fletcher G., et al., 2006 | 60. m/0.32 mm/0.5 μm, He, 40. C @ 2. min, 3. K/min, 250. C @ 10. min |
Capillary | DB-Wax | 1857. | Fan and Qian, 2005 | 30. m/0.32 mm/0.25 μm, N2, 40. C @ 2. min, 4. K/min, 230. C @ 5. min |
Capillary | Carbowax 20M | 1852. | de la Fuente, Martinez-Castro, et al., 2005 | 50. m/0.25 mm/0.25 μm, Helium, 40. C @ 2. min, 4. K/min, 190. C @ 30. min |
Capillary | Stabilwax DA | 1873. | Nogueira, Lubachevsky, et al., 2005 | 60. m/0.25 mm/0.5 μm, 40. C @ 5. min, 5. K/min; Tend: 180. C |
Capillary | DB-Wax | 1874. | Qian and Wang, 2005 | 60. m/0.32 mm/0.50 μm, Nitrogen, 35. C @ 4. min, 2. K/min, 235. C @ 30. min |
Capillary | ZB-Wax | 1849. | N/A | 30. m/0.32 mm/0.25 μm, Helium, 40. C @ 2. min, 5. K/min, 250. C @ 5. min |
Capillary | ZB-Wax | 1858. | N/A | 30. m/0.32 mm/0.25 μm, Helium, 40. C @ 2. min, 5. K/min, 250. C @ 5. min |
Capillary | ZB-Wax | 1861. | N/A | 30. m/0.32 mm/0.25 μm, Helium, 40. C @ 2. min, 5. K/min, 250. C @ 5. min |
Capillary | ZB-Wax | 1865. | N/A | 30. m/0.32 mm/0.25 μm, Helium, 40. C @ 2. min, 5. K/min, 250. C @ 5. min |
Capillary | ZB-Wax | 1866. | N/A | 30. m/0.32 mm/0.25 μm, Helium, 40. C @ 2. min, 5. K/min, 250. C @ 5. min |
Capillary | ZB-Wax | 1858. | Wu, Krings, et al., 2005 | 30. m/0.32 mm/0.25 μm, He, 40. C @ 2. min, 5. K/min, 250. C @ 10. min |
Capillary | PEG-20M | 1868. | Yao, Guo, et al., 2005 | 60. C @ 10. min, 3. K/min, 180. C @ 30. min; Column length: 30. m; Column diameter: 0.25 mm |
Capillary | DB-Wax | 1872. | Culleré, Escudero, et al., 2004 | 30. m/0.32 mm/0.5 μm, H2, 40. C @ 5. min, 4. K/min; Tend: 200. C |
Capillary | DB-Wax | 1842. | Jiang and Kubota, 2004 | He, 60. C @ 4. min, 2. K/min; Column length: 60. m; Column diameter: 0.25 mm; Tend: 220. C |
Capillary | DB-Wax | 1860. | López, Ezpeleta, et al., 2004 | 60. m/0.25 mm/0.25 μm, He, 40. C @ 5. min, 3. K/min; Tend: 220. C |
Capillary | PEG-20M | 1804. | Narain, Almeida, et al., 2004 | 50. m/0.20 mm/0.20 μm, 40. C @ 5. min, 3. K/min, 180. C @ 30. min |
Capillary | HP-Innowax | 1869. | Soria, Gonzalez, et al., 2004 | 50. m/0.2 mm/0.2 μm, He, 45. C @ 2. min, 4. K/min, 190. C @ 50. min |
Capillary | DB-Wax | 1861. | Alves and Franco, 2003 | 30. m/0.25 mm/0.5 μm, H2, 50. C @ 10. min, 3. K/min, 200. C @ 10. min |
Capillary | Stabilwax | 1848. | Cros, Vandanjon, et al., 2003, 2 | 60. m/0.25 mm/0.25 μm, Helium, 40. C @ 5. min, 3. K/min, 240. C @ 10. min |
Capillary | DB-Wax | 1846. | Dregus and Engel, 2003 | 60. m/0.32 mm/0.25 μm, H2, 40. C @ 5. min, 4. K/min, 230. C @ 25. min |
Capillary | DB-Wax | 1840. | Lee and Noble, 2003 | 30. m/0.25 mm/0.25 μm, He, 40. C @ 4. min, 4. K/min, 185. C @ 20. min |
Capillary | DB-Wax | 1848. | Lin, Cai, et al., 2003 | 30. m/0.25 mm/0.25 μm, He, 50. C @ 2. min, 3. K/min, 230. C @ 20. min |
Capillary | DB-Wax | 1869. | López, Ortín, et al., 2003 | 30. m/0.32 mm/0.5 μm, H2, 40. C @ 5. min, 4. K/min; Tend: 200. C |
Capillary | TC-Wax | 1846. | Miyazawa and Okuno, 2003 | He, 4. K/min, 250. C @ 30. min; Column length: 60. m; Column diameter: 0.25 mm; Tstart: 80. C |
Capillary | DB-Wax | 1849. | Tanaka, Yamauchi, et al., 2003 | 30. m/0.25 mm/0.25 μm, 30. C @ 1. min, 4. K/min; Tend: 250. C |
Capillary | DB-Wax | 1850. | Tanaka, Yamauchi, et al., 2003 | 30. m/0.25 mm/0.25 μm, 30. C @ 1. min, 4. K/min; Tend: 250. C |
Capillary | Supelcowax-10 | 1841. | Vichi, Castellote, et al., 2003 | 30. m/0.25 mm/0.25 μm, He, 40. C @ 10. min, 3. K/min; Tend: 200. C |
Capillary | Supelcowax-10 | 1836. | Vichi, Pizzale, et al., 2003 | 30. m/0.25 mm/0.25 μm, He, 40. C @ 10. min, 3. K/min; Tend: 200. C |
Capillary | Supelcowax-10 | 1835. | Vichi, Pizzale, et al., 2003, 2 | 30. m/0.25 mm/0.25 μm, He, 40. C @ 10. min, 3. K/min; Tend: 200. C |
Capillary | HP-FFAP | 1864. | Wanakhachornkrai and Lertsiri, 2003 | 25. m/0.32 mm/0.5 μm, He, 15. K/min; Tstart: 45. C; Tend: 220. C |
Capillary | DB-FFAP | 1832. | Czerny and Schieberle, 2002 | 30. m/0.32 mm/0.25 μm, He, 40. C @ 2. min, 6. K/min, 230. C @ 10. min |
Capillary | DB-Wax | 1870. | Ferreira, Ortín, et al., 2002 | 30. m/0.32 mm/0.5 μm, H2, 40. C @ 5. min, 4. K/min; Tend: 200. C |
Capillary | DB-Wax | 1814. | Fu, Yoon, et al., 2002 | 30. m/0.25 mm/0.25 μm, He, 40. C @ 5. min, 8. K/min, 250. C @ 5. min |
Capillary | TC-Wax | 1847. | Fukami, Ishiyama, et al., 2002 | 60. m/0.25 mm/0.25 μm, He, 2. K/min; Tstart: 50. C; Tend: 230. C |
Capillary | DB-Wax | 1849. | Ito, Sugimoto, et al., 2002 | 60. C @ 4. min, 3. K/min; Column length: 60. m; Column diameter: 0.25 mm; Tend: 180. C |
Capillary | HP-FFAP | 1797. | Qian and Reineccius, 2002 | 25. m/0.32 mm/0.52 μm, 60. C @ 1. min, 5. K/min, 240. C @ 5. min |
Capillary | TC-Wax | 1835. | Suhardi, Suzuki, et al., 2002 | 60. m/0.25 mm/0.25 μm, He, 40. C @ 10. min, 3. K/min, 230. C @ 10. min |
Capillary | DB-Wax | 1863. | Aznar, López, et al., 2001 | 30. m/0.32 mm/0.5 μm, H2, 40. C @ 5. min, 4. K/min, 200. C @ 60. min |
Capillary | FFAP | 1847. | Ducruet, Fournier, et al., 2001 | 30. m/0.32 mm/0.25 μm, H2, 40. C @ 5. min, 3. K/min; Tend: 240. C |
Capillary | DB-Wax | 1832. | Duque, Bonilla, et al., 2001 | 30. m/0.25 mm/0.25 μm, Helium, 4. K/min, 220. C @ 30. min; Tstart: 25. C |
Capillary | DB-Wax | 1863. | Ferreira, Aznar, et al., 2001 | 30. m/0.32 mm/0.5 μm, H2, 40. C @ 5. min, 4. K/min, 200. C @ 60. min |
Capillary | TC-Wax | 1861. | Miyazawa, Kurose, et al., 2001 | He, 4. K/min, 250. C @ 47. min; Column length: 60. m; Column diameter: 0.25 mm; Tstart: 80. C |
Capillary | DB-Wax | 1802. | Weckerle, Bastl-Borrmann, et al., 2001 | 30. m/0.25 mm/0.25 μm, He, 50. C @ 3. min, 4. K/min; Tend: 220. C |
Capillary | DB-Wax | 1832. | Wei, Mura, et al., 2001 | 60. m/0.25 mm/0.25 μm, He, 2. K/min; Tstart: 40. C; Tend: 200. C |
Capillary | DB-Wax | 1825. | Buttery, Light, et al., 2000 | 60. m/0.25 mm/0.25 μm, 30. C @ 4. min, 2. K/min, 170. C @ 30. min |
Capillary | Supelcowax-10 | 1826. | Korány, Mednyánszky, et al., 2000 | 60. m/0.25 mm/0.25 μm, He, 4. K/min; Tstart: 60. C; Tend: 280. C |
Capillary | DB-Wax | 1841. | Kotseridis and Baumes, 2000 | 30. m/0.32 mm/0.5 μm, H2, 60. C @ 3. min, 3. K/min, 245. C @ 20. min |
Capillary | DB-Wax | 1841. | Kotseridis and Baumes, 2000 | 30. m/0.32 mm/0.5 μm, H2, 60. C @ 3. min, 3. K/min, 245. C @ 20. min |
Capillary | DB-Wax | 1812. | Morales, Duque, et al., 2000 | 25. m/0.25 mm/0.25 μm, He, 50. C @ 4. min, 4. K/min, 200. C @ 10. min |
Capillary | DB-Wax | 1833. | Morales, Duque, et al., 2000 | 25. m/0.25 mm/0.25 μm, He, 50. C @ 4. min, 4. K/min, 200. C @ 10. min |
Capillary | DB-Wax | 1833. | Morales, Duque, et al., 2000 | 25. m/0.25 mm/0.25 μm, He, 50. C @ 4. min, 4. K/min, 200. C @ 10. min |
Capillary | DB-Wax | 1840. | Morales, Duque, et al., 2000 | 25. m/0.25 mm/0.25 μm, He, 50. C @ 4. min, 4. K/min, 200. C @ 10. min |
Capillary | DB-Wax | 1838. | Parada, Duque, et al., 2000 | 30. m/0.25 mm/0.25 μm, He, 50. C @ 3. min, 4. K/min, 240. C @ 10. min |
Capillary | DB-Wax | 1848. | Parada, Duque, et al., 2000 | 30. m/0.25 mm/0.25 μm, He, 50. C @ 3. min, 4. K/min, 240. C @ 10. min |
Capillary | DB-Wax | 1853. | Tamura, Boonbumrung, et al., 2000 | Nitrogen, 40. C @ 10. min, 2. K/min; Column length: 60. m; Column diameter: 0.25 mm; Tend: 200. C |
Capillary | DB-Wax | 1825. | Buttery, Orts, et al., 1999 | 30. C @ 4. min, 2. K/min, 170. C @ 60. min; Column length: 60. m; Column diameter: 0.32 mm |
Capillary | DB-Wax | 1815. | Chyau and Mau, 1999 | 60. m/0.25 mm/0.25 μm, N2, 3. K/min; Tstart: 40. C; Tend: 210. C |
Capillary | DB-Wax | 1835. | Iwatsuki, Mizota, et al., 1999 | 4. K/min; Column length: 30. m; Column diameter: 0.53 mm; Tstart: 60. C; Tend: 210. C |
Capillary | DB-Wax | 1840. | Iwatsuki, Mizota, et al., 1999 | 4. K/min; Column length: 30. m; Column diameter: 0.53 mm; Tstart: 60. C; Tend: 210. C |
Capillary | Innowax | 1871. | Kaya, Baser, et al., 1999 | 60. m/0.25 mm/0.25 μm, He, 60. C @ 10. min; Tend: 220. C |
Capillary | HP-Innowax | 1871. | Kaya, Baser, et al., 1999, 2 | 60. m/0.25 mm/0.25 μm, He, 60. C @ 10. min; Tend: 220. C |
Capillary | DB-Wax | 1849. | Kumazawa and Masuda, 1999 | 30. m/0.53 mm/1. μm, 5. K/min; Tstart: 40. C; Tend: 210. C |
Capillary | DB-Wax | 1852. | Kumazawa and Masuda, 1999 | 60. m/0.25 mm/0.25 μm, 5. K/min; Tstart: 40. C; Tend: 210. C |
Capillary | Carbowax 20M | 1854. | Lopez, Ferreira, et al., 1999 | 60. m/0.32 mm/0.5 μm, He, 40. C @ 5. min, 2. K/min; Tend: 190. C |
Capillary | DB-Wax | 1845. | Suriyaphan, Drake, et al., 1999 | 30. m/0.33 mm/0.25 μm, Helium, 40. C @ 5. min, 6. K/min, 200. C @ 30. min |
Capillary | DB-Wax | 1849. | Umano, Nakahara, et al., 1999 | 60. m/0.25 mm/0.25 μm, He, 40. C @ 2. min, 2. K/min; Tend: 200. C |
Capillary | DB-Wax | 1825. | Buttery and Ling, 1998 | 30. C @ 4. min, 2. K/min, 170. C @ 30. min; Column length: 60. m; Column diameter: 0.25 mm |
Capillary | Supelcowax-10 | 1873. | Campeanu, Burcea, et al., 1998 | 60. m/0.32 mm/0.5 μm, H2, 35. C @ 5. min, 5. K/min, 250. C @ 20. min |
Capillary | HP-Innowax | 1836. | Ong and Acree, 1998 | 4. K/min; Column length: 25. m; Column diameter: 0.32 mm; Tstart: 35. C; Tend: 250. C |
Capillary | HP-Innowax | 1836. | Ong, Acree, et al., 1998 | 4. K/min; Column length: 25. m; Column diameter: 0.32 mm; Tstart: 35. C; Tend: 250. C |
Capillary | DB-Wax | 1835. | Parada and Duque, 1998 | 30. m/0.25 mm/0.25 μm, He, 50. C @ 3. min, 4. K/min, 240. C @ 10. min |
Capillary | DB-Wax | 1848. | Parada and Duque, 1998 | 30. m/0.25 mm/0.25 μm, He, 50. C @ 3. min, 4. K/min, 240. C @ 10. min |
Capillary | Innowax | 1849. | Petersen, Poll, et al., 1998 | 30. m/0.25 mm/0.25 μm, 40. C @ 10. min, 6. K/min, 240. C @ 25. min |
Capillary | PEG-20M | 1853. | Awano, Honda, et al., 1997 | He, 3. K/min; Column length: 60. m; Column diameter: 0.25 mm; Tstart: 70. C; Tend: 210. C |
Capillary | CP-Wax 52CB | 1848. | Chyau, Lin, et al., 1997 | 50. m/0.32 mm/0.25 μm, He, 50. C @ 5. min, 1.5 K/min, 210. C @ 10. min |
Capillary | DB-Wax | 1847. | Sekiwa, Kubota, et al., 1997 | He, 2. K/min; Column length: 60. m; Column diameter: 0.25 mm; Tstart: 60. C; Tend: 180. C |
Capillary | HP-Innowax | 1882. | Ulrich, Hoberg, et al., 1997 | 60. m/0.32 mm/0.5 μm, H2, 1.5 K/min; Tstart: 50. C; Tend: 180. C |
Capillary | DB-Wax | 1852. | Wada and Shibamoto, 1997 | He, 3. K/min, 200. C @ 40. min; Column length: 60. m; Column diameter: 0.25 mm; Tstart: 50. C |
Capillary | PEG-20M | 1808. | Kubota, Matsujage, et al., 1996 | 50. m/0.25 mm/0.25 μm, Nitrogen, 2. K/min; Tstart: 60. C; Tend: 180. C |
Capillary | DB-Wax | 1829. | Morales, Albarracín, et al., 1996 | 30. m/0.25 mm/0.25 μm, He, 20. C @ 4. min, 4. K/min, 200. C @ 10. min |
Capillary | DB-Wax | 1812. | Morales, Albarracín, et al., 1996 | 30. m/0.25 mm/0.25 μm, He, 50. C @ 4. min, 4. K/min, 200. C @ 10. min |
Capillary | TC-Wax | 1860. | Shuichi, Masazumi, et al., 1996 | 80. C @ 5. min, 3. K/min; Column length: 60. m; Column diameter: 0.25 mm; Tend: 240. C |
Capillary | Supelcowax-10 | 1856. | Wong and Lai, 1996 | 60. m/0.25 mm/0.25 μm, He, 40. C @ 3. min, 3. K/min, 200. C @ 30. min |
Capillary | DB-Wax | 1845. | Christensen and Reineccius, 1995 | 30. m/0.25 mm/0.25 μm, 20. C @ 1. min, 5. K/min; Tend: 230. C |
Capillary | Supelcowax-10 | 1871. | Girard and Lau, 1995 | 90. m/0.25 mm/0.25 μm, He, 35. C @ 20. min, 2. K/min, 220. C @ 30. min |
Capillary | Carbowax 20M | 1807. | Kawakami, Ganguly, et al., 1995 | 60. C @ 4. min, 2. K/min; Column length: 60. m; Column diameter: 0.25 mm; Tend: 180. C |
Capillary | DB-Wax | 1836. | Kobayashi, Tsuda, et al., 1995 | He, 60. C @ 4. min, 2. K/min; Column length: 60. m; Column diameter: 0.25 mm; Tend: 180. C |
Capillary | DB-Wax | 1844. | Kobayashi, Tsuda, et al., 1995 | He, 60. C @ 4. min, 2. K/min; Column length: 60. m; Column diameter: 0.25 mm; Tend: 180. C |
Capillary | PEG-20M | 1807. | Togari, Kobayashi, et al., 1995 | 50. m/0.25 mm/0.15 μm, He, 60. C @ 4. min, 2. K/min; Tend: 180. C |
Capillary | PEG-20M | 1807. | Togari, Kobayashi, et al., 1995 | 50. m/0.25 mm/0.15 μm, He, 60. C @ 4. min, 2. K/min; Tend: 180. C |
Capillary | DB-Wax | 1866. | Chung, Eiserich, et al., 1993 | 60. C @ 4. min, 3. K/min; Column length: 60. m; Column diameter: 0.25 mm; Tend: 220. C |
Capillary | Carbowax 20M | 1807. | Kawakami, Kobayashi, et al., 1993 | He, 60. C @ 4. min, 2. K/min; Column length: 50. m; Column diameter: 0.25 mm; Tend: 180. C |
Capillary | DB-Wax | 1851. | Shimoda, Shiratsuchi, et al., 1993 | 60. m/0.25 mm/0.25 μm, He, 50. C @ 4. min, 2. K/min; Tend: 230. C |
Capillary | CP-Wax 52CB | 1871.6 | Chyau, Chen, et al., 1992 | 50. m/0.32 mm/0.22 μm, H2, 50. C @ 5. min, 2. K/min; Tend: 200. C |
Capillary | DB-Wax | 1820. | Hatsuko, Kazuko, et al., 1992 | He, 60. C @ 10. min, 3. K/min; Column length: 30. m; Column diameter: 0.25 mm; Tend: 240. C |
Capillary | Supelcowax-10 | 1850. | Miranda-López, Libbey, et al., 1992 | 60. m/0.75 mm/1. μm, 80. C @ 5. min, 2. K/min; Tend: 200. C |
Capillary | Supelcowax-10 | 1853. | Miranda-López, Libbey, et al., 1992 | 60. m/0.75 mm/1. μm, 80. C @ 5. min, 2. K/min; Tend: 200. C |
Capillary | Carbowax 20M | 1807. | Kawakami and Kobayashi, 1991 | He, 60. C @ 4. min, 2. K/min; Column length: 50. m; Column diameter: 0.25 mm; Tend: 180. C |
Capillary | SP-1000 | 1847. | De Llano D.G., Ramos M., et al., 1990 | 25. m/0.2 mm/0.43 μm, N2, 4. K/min, 190. C @ 30. min; Tstart: 60. C |
Capillary | Supelcowax-10 | 1850. | Hsieh, Williams, et al., 1989 | 60. m/0.25 mm/0.25 μm, He, 40. C @ 5. min, 1. K/min; Tend: 175. C |
Capillary | DB-Wax | 1855. | Andersen J.F., Mikolajczak K.L., et al., 1987 | Helium, 40. C @ 1. min, 6. K/min; Column length: 30. m; Column diameter: 0.32 mm; Tend: 200. C |
Capillary | Carbowax 20M | 1830. | Buttery, Ling, et al., 1983 | 50. C @ 30. min, 1. K/min, 170. C @ 60. min; Column length: 150. m; Column diameter: 0.64 mm |
Capillary | Carbowax 20M | 1880. | Buttery, Parker, et al., 1981 | 50. C @ 30. min, 1. K/min; Column length: 150. m; Column diameter: 0.64 mm; Tend: 170. C |

Normal alkane RI, polar column, custom temperature program

Column type | Active phase | I | Reference | Comment |
---|---|---|---|---|
Capillary | EC-1000 | 1845. | Delabre and Bendall, 9999 | Program: not specified |
Capillary | FFAP-CB | 1835. | Collin, Nizet, et al., 2012, 2 | 25. m/0.32 mm/0.30 μm, Nitrogen; Program: 36 0C 20 0C/min -> 85 0C 1 0C/min -> 145 0C 3 0C/min -> 220 0C |
Capillary | DB-Wax | 1844. | Gyawali and Kim, 2012 | 60. m/0.20 mm/0.25 μm, Helium; Program: 40 0C (3 min) 2 0C/min -> 150 0C 4 0C/min -> 220 0C (20 min) 5 0C/min -> 230 0C |
Capillary | Carbowax 20M | 1849. | Lee, Chong, et al., 2012 | Program: not specified |
Capillary | DB-Wax | 1855. | Welke, Manfroi, et al., 2012 | 30. m/0.25 mm/0.25 μm, Helium; Program: not specified |
Capillary | DB-Wax | 1863. | Welke, Manfroi, et al., 2012 | 30. m/0.25 mm/0.25 μm, Helium; Program: not specified |
Capillary | DB-Wax | 1871. | Welke, Manfroi, et al., 2012 | 30. m/0.25 mm/0.25 μm, Helium; Program: not specified |
Capillary | SOLGel-Wax | 1865. | Johanningsmeier and McFeeters, 2011 | 30. m/0.25 mm/0.25 μm, Helium; Program: 40 0C (2 min) 5 0C/min -> 140 0C 10 0C/min -> 250 0C (3 min) |
Capillary | SOLGel-Wax | 1841. | Johanningsmeier and McFeeters, 2011 | 30. m/0.25 mm/0.25 μm, Helium; Program: not specified |
Capillary | CP-Wax 52 CB | 1848. | Povolo, Cabassi, et al., 2011 | Program: not specified |
Capillary | DB-Wax | 1846. | Sampaio, Garruti, et al., 2011 | 30. m/0.25 mm/0.25 μm, Hydrogen; Program: 35 0C (9 min) 5 0C/min -> 80 0C 1 0C/min -> 100 0C 16 0C/min -> 210 0C (20 min) |
Capillary | HP-Innowax | 1870. | Xiao, Dai, et al., 2011 | 60. m/0.25 mm/0.25 μm, Helium; Program: 40 0C (2 min) 3 0C/min -> 150 0C 5 0C/min -> 220 0C (5 min) |
Capillary | Stabilwax | 1870. | Chinnici, Guerrero, et al., 2009 | 30. m/0.25 mm/0.25 μm, Helium; Program: 35 0C 3 0C/min -> 100 0C 5 0C/min -> 240 0C (10 min) |
Capillary | Polyethylene glycol (Free Fatty Acid Phase) | 1835. | Harraca, Syed, et al., 2009 | Column length: 30. m; Column diameter: 0.25 mm; Program: not specified |
Capillary | Polyethylene glycol (Free Fatty Acid Phase) | 1836. | Harraca, Syed, et al., 2009 | Column length: 30. m; Column diameter: 0.25 mm; Program: not specified |
Capillary | Polyethylene glycol (Free Fatty Acid Phase) | 1841. | Harraca, Syed, et al., 2009 | Column length: 30. m; Column diameter: 0.25 mm; Program: not specified |
Capillary | DB-FFAP | 1845. | Mebazaa, Mahmoudi, et al., 2009 | 30. m/0.25 mm/0.25 μm, Helium; Program: 50 0C 2 0C/min -> 100 0C (5 min) 5 0C/min -> 250 0C |
Capillary | DB-FFAP | 1846. | Mebazaa, Mahmoudi, et al., 2009 | 30. m/0.25 mm/0.25 μm, Helium; Program: not specified |
Capillary | DB-Wax | 1863. | Li, Tao, et al., 2008 | 30. m/0.32 mm/0.25 μm, Helium; Program: 40 0C (3 min) 4 0C/min -> 160 0C 7 0C/min -> 220 0C (8 min) |
Capillary | DB-Wax | 1830. | Tao, Wenlai, et al., 2008 | 30. m/0.32 mm/0.25 μm, Helium; Program: 50 0C 20 0C/min -> 80 0C 3 0C/min -> 230 0C |
Capillary | DB-Wax | 1863. | Yongsheng, Hua, et al., 2008 | 30. m/0.32 mm/0.25 μm, Helium; Program: 40 0C (4 min) 3 0C/min -> 50 0C 5 0C/min -> 120 0C 7 0C/min -> 175 0C 10 0C/min -> 230 0C (8 min) |
Capillary | PEG 20M | 1850. | Zhang, Zhang, et al., 2008 | 30. m/0.25 mm/0.25 μm, Helium; Program: 40 0C (3 min) 5 0C/min -> 60 0C 6 0C/min -> 130 0C 10 0C/min -> 230 0C |
Capillary | Supelcowax-10 | 1885. | Bosch-Fuste, Riu-Aumatell, et al., 2007 | 30. m/0.25 mm/0.25 μm, He; Program: 40C(10min) => 2C/min => 200C(1min) => 2C/min => 250C (10min) |
Capillary | DB-Wax | 1863. | Li, Tao, et al., 2007 | 30. m/0.32 mm/0.25 μm, He; Program: 40C(3min) => 4C/min => 160C => 7C/min => 230C (8min) |
Capillary | DB-Wax | 1816. | Selli, 2007 | 30. m/0.32 mm/0.50 μm, Hydrogen; Program: 60 0C (3 min) 2 0C/min -> 220 0C 3 0C/min -> 245 0C (20 min) |
Capillary | HP-Innowax | 1876. | Weldegergis B.T., Tredoux A.G.J., et al., 2007 | 30. m/0.25 mm/0.5 μm, He; Program: 30C(2min) => 4C/min => 130C => 8C/min => 250C(5min) |
Capillary | PEG-20M | 1850. | Zhang C., Zhang H., et al., 2007 | 30. m/0.25 mm/0.25 μm; Program: 40C(3min) => 5C/min => 60C => 6C/min => 130C => 10C/min => 230C (10min) |
Capillary | DB-Wax | 1852. | Krings, Zelena, et al., 2006 | 30. m/0.32 mm/0.25 μm, He; Program: 45C(5min) => 5C/min => 150C => 10C/min => 240C (10min) |
Capillary | HP-Innowax | 1849. | Quijano and Pino, 2006 | 60. m/0.25 mm/0.25 μm, Nitrogen; Program: 50 0C (4 min) -> 40 0C 4 0C/min -> 220 0C |
Capillary | Supelcowax-10 | 1826. | Riu-Aumatell, Bosch-Fuste´, et al., 2006 | 30. m/0.25 mm/0.25 μm; Program: not specified |
Capillary | Carbowax 20M | 1813. | Editorial paper, 2005 | Program: not specified |
Capillary | Carbowax 20M | 1821. | Editorial paper, 2005 | Program: not specified |
Capillary | DB-Wax | 1840. | Steinhaus and Schieberle, 2005 | 30. m/0.32 mm/0.25 μm, He; Program: 40 0C (2 min) 6 K/min -> 190 0C 12 K/min -> 240 0C |
Capillary | Innowax FSC | 1870. | Baser, Özek, et al., 2004 | 60. m/0.25 mm/0.25 μm, He; Program: 60C(10min) => 4C/min => 220C(10min) => 1C/min => 240C |
Capillary | Innowax FSC | 1871. | Baser, Özek, et al., 2004 | 60. m/0.25 mm/0.25 μm, He; Program: 60C(10min) => 4C/min => 220C(10min) => 1C/min => 240C |
Capillary | FFAP | 1848. | Didzbalis, Ritter, et al., 2004 | 30. m/0.32 mm/0.25 μm, He; Program: 35C(1min) => 60C/min => 60C => 6C/min => 230C |
Capillary | DB-Wax | 1870. | Escudero, Gogorza, et al., 2004 | Program: not specified |
Capillary | BP-21 | 1845. | Salinas, Zalacain, et al., 2004 | 50. m/0.22 mm/0.25 μm, He; Program: 50C => 2.5C/min => 180C(2min) => 1C/min => 200C(10min) |
Capillary | Carbowax 20M | 1868. | Vinogradov, 2004 | Program: not specified |
Capillary | DB-Wax | 1854. | Peterson and Reineccius, 2003, 2 | Program: not specified |
Capillary | DB-Wax | 1832. | Selli, Cabaroglu, et al., 2003 | 30. m/0.32 mm/0.5 μm, He; Program: 60C(2min) => 2C/min => 220C => 3C/min => 245C(20min) |
Capillary | CP-Wax 52CB | 1836. | Escalona, Birkmyre, et al., 2002 | 30. m/0.25 mm/0.25 μm, He; Program: 50C(5min) => 7C/min => 180C => 10C/min => 240C(10min) |
Capillary | Supelcowax-10 | 1832. | Rogerson and de Freitas, 2002 | 60. m/0.25 mm/0.25 μm, He; Program: 40C(20min) => (1.5C/min) => 200C => (10C/min) => 250C(120min) |
Capillary | TRWAX | 1871. | Torrens, 2002 | 60. m/0.25 mm/0.25 μm, He; Program: not specified |
Capillary | CP-Wax 52CB | 1834. | Escalona, Birkmyre, et al., 2001 | 30. m/0.25 mm/0.25 μm, He; Program: 50C(5min) => 7C/min => 180C => 10C/min => 240C(10min) |
Capillary | Nukol | 1852. | López and Dufour, 2001 | N2; Column length: 25. m; Column diameter: 0.25 mm; Program: 45C(5min) => 20C/min => 100C(1min) => 3C/min => 190C(40min) |
Capillary | DB-Wax | 1834. | Mayorga, Knapp, et al., 2001 | 30. m/0.25 mm/0.25 μm; Program: 50C(4min) => 4C/min => 130C => 1C/min => 190C => 4C/min => 220C(20min) |
Capillary | DB-Wax | 1839. | Mayorga, Knapp, et al., 2001 | 30. m/0.25 mm/0.25 μm; Program: 50C(4min) => 4C/min => 130C => 1C/min => 190C => 4C/min => 220C(20min) |
Capillary | DB-Wax | 1847. | Miranda, Nogueira, et al., 2001 | 30. m/0.25 mm/0.25 μm, He; Program: 25 0C (0.5 min) 50 K/min -> 50 0C 3.5 K/min -> 150 0C 7.5 K/min -> 240 0C |
Capillary | Innowax FSC | 1870. | Saglam, Gozler, et al., 2001 | 60. m/0.25 mm/0.25 μm, He; Program: 60C(10min) => 4C/min => 220C(10min) => 1C/min => 240C |
Capillary | Carbowax 20M | 1839. | Teai, Claude-Lafontaine, et al., 2001 | 50. m/0.2 mm/0.2 μm, N2; Program: 60C => 2C/min => 150C => 4C/min => 220C |
Capillary | FFAP | 1830. | Lambert, Demazeau, et al., 1999 | 30. m/0.32 mm/0.25 μm; Program: not specified |
Capillary | FFAP | 1821. | Matsui, Guth, et al., 1998 | 30. m/0.32 mm/0.25 μm, He; Program: 35C(1min) => 40C/min => 60C (1min) => 6C/min => 230C |
Capillary | PEG | 1857. | Vas, Gal, et al., 1998 | 40. m/0.182 mm/0.30 μm, Hydrogen; Program: 35 0C (5 min) 5 0C/min -> 100 0C 3 0C/min -> 200 0C (1 min) 20 0C/min -> 240 0C (2 min) |
Capillary | FFAP | 1828. | Zehentbauer and Grosch, 1998 | 25. m/0.32 mm/0.25 μm, He; Program: 35C(2min) => 40C/min => 60C(2min) => 6C/min => 230C |
Capillary | DB-Wax | 1851. | Ziegleder, 1998 | He; Column length: 60. m; Column diameter: 0.25 mm; Program: 45C(4min) => 30C/min => 60C (5min) => 3C/min => 220C(40min) |
Capillary | DB-FFAP | 1835. | Guth, 1997 | 30. m/0.32 mm/0.25 μm; Program: 35C (1min) => 40C/min => 60C (1min) => 6C/min => 250C (10min) |
Capillary | DB-FFAP | 1835. | Lizárraga-Guerra, Guth, et al., 1997 | He; Column length: 30. m; Column diameter: 0.32 mm; Program: 35C => 40C/min => 60C (1min) => 6C/min => 250C |
Capillary | CP-Wax 52CB | 1857. | López-Tamames, Carro-Mariño, et al., 1997 | 25. m/0.3 mm/1.2 μm, H2; Program: 60C(3min) => 2C/min => 220C => 3C/min => 245C |
Capillary | FFAP | 1829. | Schermann and Schieberle, 1997 | 30. m/0.32 mm/0.25 μm, He; Program: 35C (2min) => 40C/min => 60C (2min) => 6C/min => 180C => 10C/min => 240C |
Capillary | CP-Wax 52 CB | 1857. | Carro Marino, López Tamames, et al., 1995 | H2; Column length: 30. m; Column diameter: 0.32 mm; Program: 60 0C 2 0C/min -> 220 0C 3 0C/min -> 245 0C |
Capillary | DB-Wax | 1809. | Hatsuko, Kazuko, et al., 1992 | He; Column length: 30. m; Column diameter: 0.25 mm; Program: not specified |
Capillary | Supelcowax-10 | 1850. | Miranda-Lopez, Libbey, et al., 1992 | 30. m/0.53 mm/0.25 μm; Program: 80C(5min) => 5C/min => 155C => 4C/min => 240C(30min) |
Capillary | DB-Wax | 1822. | Peng, Yang, et al., 1991, 2 | Program: not specified |
Capillary | DB-Wax | 1834. | Peng, Yang, et al., 1991, 2 | Program: not specified |
Capillary | Carbowax 20M | 1817. | Peppard and Ramus, 1988 | He; Program: not specified |

Lee's RI, non-polar column, temperature ramp

Column type | Active phase | I | Reference | Comment |
---|---|---|---|---|
Capillary | DB-5 | 158.1 | Donnelly, Abdel-Hamid, et al., 1993 | 30. m/0.32 mm/0.25 μm, He, 40. C @ 3. min, 8. K/min, 285. C @ 29.5 min |

Henry's Law data

Data compiled by: Rolf Sander
Henry's Law constant (water solution)
kH(T) = k°H exp(d(ln(kH))/d(1/T) ((1/T) - 1/(298.15 K)))
k°H = Henry's law constant for solubility in water at 298.15 K (mol/(kg*bar))
d(ln(kH))/d(1/T) = Temperature dependence constant (K)
k°H (mol/(kg*bar)) | d(ln(kH))/d(1/T) (K) | Method | Reference |
---|---|---|---|
1200. | 5900. | Q | N/A |
1400. | 6304. | M | N/A |

References

Fenwick, Harrop, et al., 1978
Fenwick, J.O.; Harrop, D.; Head, A.J.,
Thermodynamic properties of organic oxygen compounds. 46. Enthalpies of formation of ethyl acetate and 1-hexanoix acid,
J. Chem. Thermodyn., 1978, 10, 687-690. [all data]
Adriaanse, Dekker, et al., 1965
Adriaanse, N.; Dekker, H.; Coops, J.,
Heats of combustion of normal saturated fatty acids and their methyl esters,
Rec. Trav. Chim. Pays/Bas, 1965, 84, 393-407. [all data]
Cox and Pilcher, 1970
Cox, J.D.; Pilcher, G.,
Thermochemistry of Organic and Organometallic Compounds, Academic Press, New York, 1970, 1-636. [all data]
Lebedeva, 1964
Lebedeva, N.D.,
Heats of combustion of monocarboxylic acids,
Russ. J. Phys. Chem. (Engl. Transl.), 1964, 38, 1435-1437. [all data]
Fischer and Wrede, 1904
Fischer, E.; Wrede, F.,
Uber die Verbrennungswarme einiger organischer Verbindungen,
Sitzungsber. Dtsch. Akad. Wiss. Berlin Kl. Math. Phys. Tech., 1904, 687-715. [all data]
Lemoult, 1904
Lemoult, M.P.,
Remarques sur une serie recenie de determinations calorimetriques,
Compt. Rend., 1904, 663-635. [all data]
von Reis, 1881
von Reis, M.A.,
Die specifische Wärme flüssiger organischer Verbindungen und ihre Beziehung zu deren Moleculargewicht,
Ann. Physik [3], 1881, 13, 447-464. [all data]
Adriaanse, Dekker, et al., 1964
Adriaanse, N.; Dekker, H.; Coops, J.,
Some Physical Constants of Normal, Saturated Fatty Acids and Their Methyl Esters,
Recl. Trav. Chim. Pays-Bas, 1964, 83, 557. [all data]
Costello and Bowden, 1958
Costello, J.M.; Bowden, S.T.,
The temperature variation of orthobaric density difference in liquid- vapour systems: IV fatty acids,
Recl. Trav. Chim. Pays-Bas, 1958, 77, 803. [all data]
Timmermans, 1935
Timmermans, J.,
Researches in Stoichiometry. I. The Heat of Fusion of Organic Compounds.,
Bull. Soc. Chim. Belg., 1935, 44, 17-40. [all data]
Gartenmeister, 1886
Gartenmeister, R.,
Investigation of the physical characterstics of liquid compounds: vi boiling point and specific volume of normal fatty acid esters,
Justus Liebigs Ann. Chem., 1886, 233, 249-315. [all data]
Andereya and Chase, 1990
Andereya, E.; Chase, J.D.,
Chem. Eng. Technol., 1990, 13, 304-12. [all data]
Ambrose and Ghiassee, 1987
Ambrose, D.; Ghiassee, N.B.,
Vapor Pressures and Critical Temperatures and Critical Pressures of Some Alkanoic Acids: C1 to C10,
J. Chem. Thermodyn., 1987, 19, 505. [all data]
D'Souza and Teja, 1987
D'Souza, R.; Teja, A.S.,
The prediction of the vapor pressures of carboxylic acids,
Chem. Eng. Commun., 1987, 61, 13. [all data]
Verevkin, 2000
Verevkin, S.P.,
Measurement and Prediction of the Monocarboxylic Acids Thermochemical Properties,
J. Chem. Eng. Data, 2000, 45, 5, 953-960, https://doi.org/10.1021/je990282m
. [all data]
Chickos, Hosseini, et al., 1995
Chickos, James S.; Hosseini, Sarah; Hesse, Donald G.,
Determination of vaporization enthalpies of simple organic molecules by correlations of changes in gas chromatographic net retention times,
Thermochimica Acta, 1995, 249, 41-62, https://doi.org/10.1016/0040-6031(95)90670-3
. [all data]
Kruif and Oonk, 1979
Kruif, C.G.; Oonk, H.A.J.,
Enthalpies of vaporization and vapour pressures of seven aliphatic carboxylic acids,
J. Chem. Thermodyn., 1979, 11, 287-290. [all data]
Stephenson and Malanowski, 1987
Stephenson, Richard M.; Malanowski, Stanislaw,
Handbook of the Thermodynamics of Organic Compounds, 1987, https://doi.org/10.1007/978-94-009-3173-2
. [all data]
Dykyj, 1972
Dykyj, J.,
Petrochemia, 1972, 12, 1, 13. [all data]
de Kruif, Schaake, et al., 1982
de Kruif, C.G.; Schaake, R.C.F.; van Miltenburg, J.C.; van der Klauw, K.; Blok, J.G.,
Thermodynamic properties of the normal alkanoic acids III. Enthalpies of vaporization and vapour pressures of 13 normal alkanoic acids,
The Journal of Chemical Thermodynamics, 1982, 14, 8, 791-798, https://doi.org/10.1016/0021-9614(82)90176-8
. [all data]
Rose, Acciarri, et al., 1957
Rose, Arthur.; Acciarri, Jerry A.; Johnson, R. Curtis.; Sanders, W.W.,
Automatic Computation of Antoine Equation 31 Constants---Caproic and Caprylic Acids and Methyl Esters,
Ind. Eng. Chem., 1957, 49, 1, 104-109, https://doi.org/10.1021/ie50565a036
. [all data]
Boublik, Fried, et al., 1984
Boublik, T.; Fried, V.; Hala, E.,
The Vapour Pressures of Pure Substances: Selected Values of the Temperature Dependence of the Vapour Pressures of Some Pure Substances in the Normal and Low Pressure Region, 2nd ed., Elsevier, New York, 1984, 972. [all data]
Cramer, 1943
Cramer, K.S.N.,
Chem. Zentr. II, 1943, 2234. [all data]
Caldwell, Renneboog, et al., 1989
Caldwell, G.; Renneboog, R.; Kebarle, P.,
Gas Phase Acidities of Aliphatic Carboxylic Acids, Based on Measurements of Proton Transfer Equilibria,
Can. J. Chem., 1989, 67, 4, 661, https://doi.org/10.1139/v89-092
. [all data]
McLuckey, Cameron, et al., 1981
McLuckey, S.A.; Cameron, D.; Cooks, R.G.,
Proton affinities from the dissociation of proton bound dimers,
J. Am. Chem. Soc., 1981, 103, 1313. [all data]
Holmes, Fingas, et al., 1981
Holmes, J.L.; Fingas, M.; Lossing, F.P.,
Towards a general scheme for estimating the heats of formation of organic ions in the gas phase. Part I. Odd-electron cations,
Can. J. Chem., 1981, 59, 80. [all data]
Holmes and Lossing, 1980
Holmes, J.L.; Lossing, F.P.,
Thermochemistry and unimolecular reactions of ionized acetic acid and its enol in the gas phase.,
J. Am. Chem. Soc., 1980, 102, 3732. [all data]
Holmes and Lossing, 1980, 2
Holmes, J.L.; Lossing, F.P.,
Gas-phase heats of formation of keto and enol ions of carbonyl compounds.,
J. Am. Chem. Soc., 1980, 102, 1591. [all data]
Schwob, Bessiere, et al., 2004
Schwob, I.; Bessiere, J.-M.; Masotti, V.; Viano, J.,
Changes in essential oil composition in Saint John's wort (Hypericum perforatum L.) aerial parts during its phenological cycle,
Biochem. Syst. Ecol., 2004, 32, 8, 735-745, https://doi.org/10.1016/j.bse.2003.12.005
. [all data]
Takeoka, Perrino, et al., 1996
Takeoka, G.; Perrino, C., Jr.; Buttery, R.,
Volatile constituents of used frying oils,
J. Agric. Food Chem., 1996, 44, 3, 654-660, https://doi.org/10.1021/jf950430m
. [all data]
Khan, Verma, et al., 2006
Khan, M.; Verma, S.C.; Srivastava, S.K.; Shawl, A.S.; Syamsundar, K.V.; Khanuja, S.P.S.; Kumar, T.,
Essential oil composition of Taxus wallichiana Zucc. from the Northern Himalayan region of India,
Flavour Fragr. J., 2006, 21, 5, 772-775, https://doi.org/10.1002/ffj.1682
. [all data]
Rezende and Fraga, 2003
Rezende, C.M.; Fraga, S.R.G.,
Chemical and aroma determination of the pulp and seeds of murici (Byrsonima crassifolia L.),
J. Braz. Chem. Soc., 2003, 14, 3, 425-428, https://doi.org/10.1590/S0103-50532003000300014
. [all data]
Engel and Ratel, 2007
Engel, E.; Ratel, J.,
Correction of the data generated by mass spectrometry analyses of biological tissues: Application to food authentication,
J. Chromatogr. A, 2007, 1154, 1-2, 331-341, https://doi.org/10.1016/j.chroma.2007.02.012
. [all data]
Quijano, Salamanca, et al., 2007
Quijano, C.E.; Salamanca, G.; Pino, J.A.,
Aroma volatile constituents of Colombian varieties of mango (Mangifera indica L.),
Flavour Fragr. J., 2007, 22, 5, 401-406, https://doi.org/10.1002/ffj.1812
. [all data]
Schlutt B., Moran N., et al., 2007
Schlutt B.; Moran N.; Schieberle P.; Hofmann T.,
Sensory-directed identification of creaminess-enhancing volatiles and semivolatiles in full-fat cream,
J. Agric. Food Chem., 2007, 55, 23, 9634-9645, https://doi.org/10.1021/jf0721545
. [all data]
Wu, Zorn, et al., 2007
Wu, S.; Zorn, H.; Krings, U.; Berger, R.G.,
Volatiles from submerged and surface-cultured beefsteak fungus, Fistulina hepatica,
Flavour Fragr. J., 2007, 22, 1, 53-60, https://doi.org/10.1002/ffj.1758
. [all data]
Mahadevan and Farmer, 2006
Mahadevan, K.; Farmer, L.,
Key Odor Impact Compounds in Three Yeast Extract Pastes,
J. Agric. Food Chem., 2006, 54, 19, 7242-7250, https://doi.org/10.1021/jf061102x
. [all data]
Osorio, Alarcon, et al., 2006
Osorio, C.; Alarcon, M.; Moreno, C.; Bonilla, A.; Barrios, J.; Garzon, C.; Duque, C.,
Characterization of Odor-Active Volatiles in Champa ( Campomanesia lineatifolia R. P.),
J. Agric. Food Chem., 2006, 54, 2, 509-516, https://doi.org/10.1021/jf052098c
. [all data]
Schwambach and Peterson, 2006
Schwambach, S.L.; Peterson, D.G.,
Reduction of Stale Flavor Development in Low-Heat Skim Milk Powder via Epicatechin Addition,
J. Agric. Food Chem., 2006, 54, 2, 502-508, https://doi.org/10.1021/jf0519764
. [all data]
Whetstine M.E.C., Drake M.A., et al., 2006
Whetstine M.E.C.; Drake M.A.; Nelson B.K.; Barbano D.M.,
Flavor profiles of full-fat and reduced-fat cheese and cheese fat made from aged cheddar with the fat removed using a novel process,
J. Dairy Res., 2006, 89, 2, 505-517, https://doi.org/10.3168/jds.S0022-0302(06)72113-0
. [all data]
Colahan-Sederstrom and Peterson, 2005
Colahan-Sederstrom, P.M.; Peterson, D.G.,
Inhibition of key aroma compound generated during ultrahigh-temperature processing of bovine milk via epicatechin addition,
J. Agric. Food Chem., 2005, 53, 2, 398-402, https://doi.org/10.1021/jf0487248
. [all data]
Estevez, Ventanas, et al., 2005
Estevez, M.; Ventanas, S.; Ramirez, R.; Cava, R.,
Influence of the Addition of Rosemary Essential Oil on the Volatiles Pattern of Porcine Frankfurters,
J. Agric. Food Chem., 2005, 53, 21, 8317-8324, https://doi.org/10.1021/jf051025q
. [all data]
Pino, Mesa, et al., 2005
Pino, J.A.; Mesa, J.; Muñoz, Y.; Martí, M.P.; Marbot, R.,
Volatile components from mango (Mangifera indica L.) cultivars,
J. Agric. Food Chem., 2005, 53, 6, 2213-2223, https://doi.org/10.1021/jf0402633
. [all data]
Whetstine, Cadwallader, et al., 2005
Whetstine, M.E.C.; Cadwallader, K.R.; Drake, M.A.,
Characterization of aroma compounds responsible for the rosy/floral flavor in cheddar cheese,
J. Agric. Food Chem., 2005, 53, 8, 3126-3132, https://doi.org/10.1021/jf048278o
. [all data]
Wu, Zorn, et al., 2005
Wu, S.; Zorn, H.; Krings, U.; Berger, R.G.,
Characteristic Volatiles from Young and Aged Fruiting Bodies of Wild Polyporus sulfureus (Bull.:Fr.) Fr.,
J. Agric. Food Chem., 2005, 53, 11, 4524-4528, https://doi.org/10.1021/jf0478511
. [all data]
Avsar, Karagul-Yuceer, et al., 2004
Avsar, Y.K.; Karagul-Yuceer, Y.; Drake, M.A.; Singh, T.K.; Yoon, Y.; Cadwallader, K.R.,
Characterization of nutty flavor in cheddar cheese,
J. Dairy Sci., 2004, 87, 7, 1999-2010, https://doi.org/10.3168/jds.S0022-0302(04)70017-X
. [all data]
Píno, Marbot, et al., 2004
Píno, J.A.; Marbot, R.; Vázquez, C.,
Volatile components of the fruits of Vangueria madagascariensis J. F. Gmel. from Cuba,
J. Essent. Oil Res., 2004, 16, 4, 302-304, https://doi.org/10.1080/10412905.2004.9698727
. [all data]
Karagül-Yüceer, Vlahovich, et al., 2003
Karagül-Yüceer, Y.; Vlahovich, K.N.; Drake, M.A.; Cadwallader, K.R.,
Characteristic aroma components of rennet casein,
J. Agric. Food Chem., 2003, 51, 23, 6797-6801, https://doi.org/10.1021/jf0345806
. [all data]
Lalel, Singh, et al., 2003
Lalel, H.J.D.; Singh, Z.; Chye Tan, S.,
Glycosidically-bound aroma volatile compounds in the skin and pulp of 'Kensington Pride' mango fruit at different stages of maturity,
Postharvest Biol. Technol., 2003, 29, 2, 205-218, https://doi.org/10.1016/S0925-5214(02)00250-8
. [all data]
Peterson and Reineccius, 2003
Peterson, D.G.; Reineccius, G.A.,
Characterization of the volatile compounds that constitute fresh sweet cream butter aroma,
Flavour Fragr. J., 2003, 18, 3, 215-220, https://doi.org/10.1002/ffj.1192
. [all data]
Peterson and Reineccius, 2003, 2
Peterson, D.G.; Reineccius, G.A.,
Determination of the aroma impact compounds in heated sweet cream butter,
Flavour Fragr. J., 2003, 18, 4, 320-324, https://doi.org/10.1002/ffj.1228
. [all data]
Pino, Marbot, et al., 2003
Pino, J.; Marbot, R.; Rosado, A.; Vázquez, C.,
Volatile constituents of fruits of Garcinia dulcis Kurz. from Cuba,
Flavour Fragr. J., 2003, 18, 4, 271-274, https://doi.org/10.1002/ffj.1187
. [all data]
Karagül-Yüceer, Cadwallader, et al., 2002
Karagül-Yüceer, Y.; Cadwallader, K.R.; Drake, M.A.,
Volatile flavor components of stored nonfat dry milk,
J. Agric. Food Chem., 2002, 50, 2, 305-312, https://doi.org/10.1021/jf010648a
. [all data]
Pino, Marbot, et al., 2002
Pino, J.; Marbot, R.; Rosado, A.,
Volatile constituents of star apple (Chrysophyllum cainito L.) from Cuba,
Flavour Fragr. J., 2002, 17, 5, 401-403, https://doi.org/10.1002/ffj.1116
. [all data]
Pino, Marbot, et al., 2002, 2
Pino, J.A.; Marbot, R.; Vázquez, C.,
Characterization of volatile in Cosa Rican Guava [Psidium friedrichsthalianum (Berg) Niedenzu] fruit,
J. Agric. Food Chem., 2002, 50, 21, 6023-6026, https://doi.org/10.1021/jf011456i
. [all data]
Karagül-Yüceer, Drake, et al., 2001
Karagül-Yüceer, Y.; Drake, M.; Cadwallader, K.R.,
Aroma-active components of nonfat dry milk,
J. Agric. Food Chem., 2001, 49, 6, 2948-2953, https://doi.org/10.1021/jf0009854
. [all data]
Larráyoz, Addis, et al., 2001
Larráyoz, P.; Addis, M.; Gauch, R.; Bosset, J.O.,
Comparison of dynamic headspace and simultaneous distillation extraction techniques used for the analysis of the volatile components in three European PDO ewes milk cheeses,
Int. Dairy J., 2001, 11, 11-12, 911-926, https://doi.org/10.1016/S0958-6946(01)00144-3
. [all data]
Nogueira, Bittrich, et al., 2001
Nogueira, P.C.L.; Bittrich, V.; Shepherd, G.J.; Lopes, A.V.; Marsaioli, A.J.,
The ecological and taxonomic importance of flower volatiles of Clusia species (Guttiferae),
Phytochemistry, 2001, 56, 5, 443-452, https://doi.org/10.1016/S0031-9422(00)00213-2
. [all data]
Pino and Marbot, 2001
Pino, J.A.; Marbot, R.,
Volatile flavor constituents of acerola (Malpighia emarginata DC.) fruit,
J. Agric. Food Chem., 2001, 49, 12, 5880-5882, https://doi.org/10.1021/jf010270g
. [all data]
Pino, Marbot, et al., 2001
Pino, J.A.; Marbot, R.; Vázquez, C.,
Characterization of volatiles in strawberry guava (Psidium cattleianum Sabine) fruit,
J. Agric. Food Chem., 2001, 49, 12, 5883-5887, https://doi.org/10.1021/jf010414r
. [all data]
Yin, Xiu, et al., 2001
Yin, W.; Xiu, Z.; Aijin, H.,
Analysis of the volatile components in trogopterorum feces by capillary gas chromatography and gas chromatography/mass spectrometry,
Fenxi Huaxue, 2001, 29, 2, 195-198. [all data]
Valero, Sanz, et al., 1999
Valero, E.; Sanz, J.; Martinez-Castro, I.,
Volatile components in microwave- and conventionally-heated milk,
Food Chem., 1999, 66, 3, 333-338, https://doi.org/10.1016/S0308-8146(99)00069-2
. [all data]
Verdier-Metz., Coulon, et al., 1998
Verdier-Metz., I.; Coulon, J.-B.; PPradel, P.; Viallon, C.; Berdague, J.-L.,
Effect of forage conservation (hay or silage) and cow breed on the coagulation properties of milks and on the characteristics of ripened cheeses,
J. Dairy Res., 1998, 65, 1, 9-21, https://doi.org/10.1017/S0022029997002616
. [all data]
Sakho, Chassagne, et al., 1997
Sakho, M.; Chassagne, D.; Crouzet, J.,
African mango glycosidically bound volatile compounds,
J. Agric. Food Chem., 1997, 45, 3, 883-888, https://doi.org/10.1021/jf960277b
. [all data]
Wu, Kuo, et al., 1991
Wu, P.; Kuo, M.-C.; Hartman, T.G.; Rosen, R.T.; Ho, C.-T.,
Free and glycosidically bound aroma compounds in pineapple (Ananas comosus L. Merr.),
J. Agric. Food Chem., 1991, 39, 1, 170-172, https://doi.org/10.1021/jf00001a033
. [all data]
Zhang and Ho, 1989
Zhang, Y.; Ho, C.-T.,
Volatile compounds formed from thermnal interaction of 2,4-decadienal with cysteine and glutathione,
J. Agric. Food Chem., 1989, 37, 4, 1016-1020, https://doi.org/10.1021/jf00088a044
. [all data]
Hendriks and Bruins, 1983
Hendriks, H.; Bruins, A.P.,
A tentative identification of components in the essential oil of Cannabis sativa L. by a combination of gas chromatography negative ion chemical ionization mass spectrometry and retention indices,
Biomed. Mass Spectrom., 1983, 10, 6, 377-381, https://doi.org/10.1002/bms.1200100607
. [all data]
Schuh and Schieberle, 2006
Schuh, C.; Schieberle, P.,
Characterization of the Key Aroma Compounds in the Beverage Prepared from Darjeeling Black Tea: Quantitative Differences between Tea Leaves and Infusion,
J. Agric. Food Chem., 2006, 54, 3, 916-924, https://doi.org/10.1021/jf052495n
. [all data]
Wang, Finn, et al., 2005
Wang, Y.; Finn, C.; Qian, M.C.,
Impact of Growing Environment on Chickasaw Blackberry ( Rubus L.) Aroma Evaluated by Gas Chromatography Olfactometry Dilution Analysis,
J. Agric. Food Chem., 2005, 53, 9, 3563-3571, https://doi.org/10.1021/jf048102m
. [all data]
Passos X.S., Castro A.C.M., et al., 2003
Passos X.S.; Castro A.C.M.; Pires J.S.; Garcia A.C.F.; Campos F.C.; Fernandes O.F.L.; Paula J.R.; Ferreira H.D.; Santos S.C.; Ferri P.H.; Silva M.D.R.,
Composition and antifungal activity of the essential oils of Caryocar brasiliensis,
Pharm. Biol., 2003, 41, 5, 319-324, https://doi.org/10.1076/phbi.41.5.319.15936
. [all data]
Place, Imhof, et al., 2003
Place, R.B.; Imhof, M.; Teuber, M.; Olivier Bosset, J.,
Distribution of the volatile (flavour) compounds in Raclette cheese produced with different staphylococci in the smear,
Mitt. Lebensmittelunters. Hyg., 2003, 94, 192-211. [all data]
Boulanger and Crouzet, 2001
Boulanger, R.; Crouzet, J.,
Identification of the aroma components of acerola (Malphigia glabra L.): free and bound flavor compounds,
Food Chem., 2001, 74, 2, 209-216, https://doi.org/10.1016/S0308-8146(01)00128-5
. [all data]
Boulanger and Crouzet, 2000
Boulanger, R.; Crouzet, J.,
Free and bound flavour components of Amazonian fruits: 2. cupuacu volatile compounds,
Flavour Fragr. J., 2000, 15, 4, 251-257, https://doi.org/10.1002/1099-1026(200007/08)15:4<251::AID-FFJ905>3.0.CO;2-2
. [all data]
Peng, 2000
Peng, C.T.,
Prediction of retention indices. V. Influence of electronic effects and column polarity on retention index,
J. Chromatogr. A, 2000, 903, 1-2, 117-143, https://doi.org/10.1016/S0021-9673(00)00901-8
. [all data]
Boulanger, Chassagne, et al., 1999
Boulanger, R.; Chassagne, D.; Crouzet, J.,
Free and bound flavour components of amazonian fruits. 1: Bacuri,
Flavour Fragr. J., 1999, 14, 5, 303-311, https://doi.org/10.1002/(SICI)1099-1026(199909/10)14:5<303::AID-FFJ834>3.0.CO;2-C
. [all data]
Tairu, Hofmann, et al., 1999
Tairu, A.O.; Hofmann, T.; Schieberle, P.,
Characterization of the key aroma compounds in dried fruits of the West African peppertree Xylopia aethiopica (Dunal) A. Rich (Annonaceae) using aroma extract dilution analysis,
J. Agric. Food Chem., 1999, 47, 8, 3285-3287, https://doi.org/10.1021/jf990228+
. [all data]
Tairu, Hofmann, et al., 1999, 2
Tairu, A.O.; Hofmann, T.; Schieberle, P.,
Identification of the key aroma compounds in dried fruits of Xylopia aethiopica
in Perspectives on new crops and new users, Janick, J., ed(s)., ASHS Press, Alexandria, VA, USA, 1999, 474-478. [all data]
Peng, Yang, et al., 1991
Peng, C.T.; Yang, Z.C.; Maltby, D.,
Prediction of retention indexes. III. Silylated derivatives of polar compounds,
J. Chromatogr., 1991, 586, 1, 113-129, https://doi.org/10.1016/0021-9673(91)80029-G
. [all data]
Peng, Ding, et al., 1988
Peng, C.T.; Ding, S.F.; Hua, R.L.; Yang, Z.C.,
Prediction of Retention Indexes I. Structure-Retention Index Relationship on Apolar Columns,
J. Chromatogr., 1988, 436, 137-172, https://doi.org/10.1016/S0021-9673(00)94575-8
. [all data]
Botelho, Caldeira, et al., 2007
Botelho, G.; Caldeira, I.; Mendes-Faia, A.; Clímaco, M.C.,
Evaluation of two quantitative gas chromatography-olfactometry methods for clonal red wines differentiation,
Flavour Fragr. J., 2007, 22, 5, 414-420, https://doi.org/10.1002/ffj.1815
. [all data]
Jarunrattanasri, Theerakulkait, et al., 2007
Jarunrattanasri, A.; Theerakulkait, C.; Cadwallader, K.R.,
Aroma Components of Acid-Hydrolyzed Vegetable Protein Made by Partial Hydrolysis of Rice Bran Protein,
J. Agric. Food Chem., 2007, 55, 8, 3044-3050, https://doi.org/10.1021/jf0631474
. [all data]
Lozano P.R., Drake M., et al., 2007
Lozano P.R.; Drake M.; Benitez D.; Cadwallader K.R.,
Instrumental and sensory characterization of heat-induced odorants in aseptically packaged soy milk,
J. Agric. Food Chem., 2007, 55, 8, 3018-3026, https://doi.org/10.1021/jf0631225
. [all data]
Lozano P.R., Miracle E.R., et al., 2007
Lozano P.R.; Miracle E.R.; Krause A.J.; Drake M.; Cadwallader K.R.,
Effect of cold storage and packaging material on the major aroma components of sweet cream butter,
J. Agric. Food Chem., 2007, 55, 19, 7840-7846, https://doi.org/10.1021/jf071075q
. [all data]
Pozo-Bayon M.A., Ruiz-Rodriguez A., et al., 2007
Pozo-Bayon M.A.; Ruiz-Rodriguez A.; Pernin K.; Cayot N.,
Influence of eggs on the aroma composition of a sponge cake and on the aroma release in model studies on flavored sponge cakes,
J. Agric. Food Chem., 2007, 55, 4, 1418-1426, https://doi.org/10.1021/jf062203y
. [all data]
Quijano, Linares, et al., 2007
Quijano, C.E.; Linares, D.; Pino, J.A.,
Changes in volatile compounds of fermented cereza agria [Phyllanthus acidus (L.) Skeels] fruit,
Flavour Fragr. J., 2007, 22, 5, 392-394, https://doi.org/10.1002/ffj.1810
. [all data]
Gurbuz O., Rouseff J.M., et al., 2006
Gurbuz O.; Rouseff J.M.; Rouseff R.L.,
Comparison of aroma volatiles in commercial Merlot and Cabernet Sauvignon wines using gas chromatography - Olfactometry and gas chromatography - Mass spectrometry,
J. Agric. Food Chem., 2006, 54, 11, 3990-3996, https://doi.org/10.1021/jf053278p
. [all data]
Lee, Lee, et al., 2006
Lee, S.-J.; Lee, J.-E.; Kim, H.-W.; Kim, S.-S.; Koh, K.-H.,
Development of Korean red wines using Vitis labrusca varieties: instrumental and sensory characterization,
Food Chem., 2006, 94, 3, 385-393, https://doi.org/10.1016/j.foodchem.2004.11.035
. [all data]
Pinto, Guedes, et al., 2006
Pinto, A.B.; Guedes, C.M.; Moreira, R.F.A.; de Maria, C.A.B.,
Volatile constituents from headspace and aqueous solution of genipap (Genipa americana) fruit isolated by the solid-phase extraction method,
Flavour Fragr. J., 2006, 21, 3, 488-491, https://doi.org/10.1002/ffj.1623
. [all data]
Bonvehí, 2005
Bonvehí, J.S.,
Investigation of aromatic compounds in roasted cocoa powder,
Eur. Food Res. Technol., 2005, 221, 1-2, 19-29, https://doi.org/10.1007/s00217-005-1147-y
. [all data]
Carunchia Whetstine, Croissant, et al., 2005
Carunchia Whetstine, M.E.; Croissant, A.E.; Drake, M.A.,
Characterization of Dried Whey Protein Concentrate and Isolate Flavor,
J. Dairy Sci., 2005, 88, 11, 3826-3839, https://doi.org/10.3168/jds.S0022-0302(05)73068-X
. [all data]
Cros, Lignot, et al., 2005
Cros, S.; Lignot, B.; Bourseau, P.; Jaouen, P.; Prost, C.,
Desalination of mussel cooking juices by electrodialysis: effect on the aroma profile,
J. Food Eng., 2005, 69, 4, 425-436, https://doi.org/10.1016/j.jfoodeng.2004.08.036
. [all data]
Fang and Qian, 2005
Fang, Y.; Qian, M.,
Aroma compounds in Oregon Pinot Noir wine determined by aroma extract dilution analysis (AEDA),
Flavour Fragr. J., 2005, 20, 1, 22-29, https://doi.org/10.1002/ffj.1551
. [all data]
Malliaa, Fernandez-Garcia, et al., 2005
Malliaa, S.; Fernandez-Garcia, E.; Bosset, J.O.,
Comparison of purge and trap and solid phase microextraction techniques for studying the volatile aroma compounds of three European PDO hard cheeses,
Int. Dairy J., 2005, 15, 6-9, 741-758, https://doi.org/10.1016/j.idairyj.2004.11.007
. [all data]
Riu-Aumatell, Lopez-Tamames, et al., 2005
Riu-Aumatell, M.; Lopez-Tamames, E.; Buxaderas, S.,
Assessment of the Volatile Composition of Juices of Apricot, Peach, and Pear According to Two Pectolytic Treatments,
J. Agric. Food Chem., 2005, 53, 20, 7837-7843, https://doi.org/10.1021/jf051397z
. [all data]
Verzera, Campisi, et al., 2005
Verzera, A.; Campisi, S.; Zappalá, M.,
SUPELCO. Using SPME-GC-MS to characterize volatile components of honey as indicators of botanical origin, 2005, retrieved from http://www.sigmaaldrich.com/Brands/SupelcoHome/TheReporter.html. [all data]
Ledauphin, Saint-Clair, et al., 2004
Ledauphin, J.; Saint-Clair, J.-F.; Lablanquie, O.; Guichard, H.; Founier, N.; Guichard, E.; Barillier, D.,
Identification of trace volatile compounds in freshly distilled calvados and cognac using preparative separations coupled with gas chromatography-mass spectrometry,
J. Agric. Food Chem., 2004, 52, 16, 5124-5134, https://doi.org/10.1021/jf040052y
. [all data]
Mahajan, Goddik, et al., 2004
Mahajan, S.S.; Goddik, L.; Qian, M.C.,
Aroma Compounds in Sweet Whey Powder,
J. Dairy Sci., 2004, 87, 12, 4057-4063, https://doi.org/10.3168/jds.S0022-0302(04)73547-X
. [all data]
Ménager, Jost, et al., 2004
Ménager, I.; Jost, M.; Aubert, C.,
Changes in physicochemical characteristics and volatile constituents of strawberry (Cv. Cigaline) during maturation,
J. Agric. Food Chem., 2004, 52, 5, 1248-1254, https://doi.org/10.1021/jf0350919
. [all data]
Nielsen, Larsen, et al., 2004
Nielsen, G.S.; Larsen, L.M.; Poll, L.,
Impact of blanching and packaging atmosphere on the formation of aroma compounds during long-term frozen storage of leek (Allium ampeloprasum Var. Bulga) slices,
J. Agric. Food Chem., 2004, 52, 15, 4844-4852, https://doi.org/10.1021/jf049623c
. [all data]
Brat, Rega, et al., 2003
Brat, P.; Rega, B.; Alter, P.; Reynes, M.; Brillouet, J.-M.,
Distribution of volatile compounds in the pulp, cloud, and serum of freshly squeezed orange juice,
J. Agric. Food Chem., 2003, 51, 11, 3442-3447, https://doi.org/10.1021/jf026226y
. [all data]
Chyau, Ko, et al., 2003
Chyau, C.-C.; Ko, P.-T.; Chang, C.-H.; Mau, J.-L.,
Free and glycosidically bound aroma compounds in lychee (Litchi chinensis Sonn.),
Food Chem., 2003, 80, 3, 387-392, https://doi.org/10.1016/S0308-8146(02)00278-9
. [all data]
Cros, Vandanjon, et al., 2003
Cros, S.; Vandanjon, L.; Jaouen, P.; Bourseau, P.,
Processing of industrial mussel cooking juices by reverse osmosis: pollution abatement and aromas recovery, 2003, retrieved from http://www.membrane.unsw.edu.au/imstec03/content/papers/DAI/imstec064.pdf. [all data]
Mau, Ko, et al., 2003
Mau, J.-L.; Ko, P.T.; Chyau, C.-C.,
Aroma characterization and antioxidant activity of supercritical carbon dioxide extracts from Terminalia catappa leaves,
Food Res. Int., 2003, 36, 1, 97-104, https://doi.org/10.1016/S0963-9969(02)00114-X
. [all data]
Rega, Fournier, et al., 2003
Rega, B.; Fournier, N.; Guichard, E.,
Solid phase microextraction (SPME) of orange juice flavor: odor representativeness by direct gas chromatography olfactometry (D-GC-O),
J. Agric. Food Chem., 2003, 51, 24, 7092-7099, https://doi.org/10.1021/jf034384z
. [all data]
Brunton, Cronin, et al., 2002
Brunton, N.P.; Cronin, D.A.; Monahan, F.J.,
Volatile components associated with freshly cooked and oxidized off-flavours in turkey breast meat,
Flavour Fragr. J., 2002, 17, 5, 327-334, https://doi.org/10.1002/ffj.1087
. [all data]
Claudela, Dirningera, et al., 2002
Claudela, P.; Dirningera, N.; Etievant, P.,
Effects of water on gas chromatographic column efficiency measurements applied to on-column injections of volatile aroma compounds,
J. Sep. Sci., 2002, 25, 5-6, 365-370, https://doi.org/10.1002/1615-9314(20020401)25:5/6<365::AID-JSSC365>3.0.CO;2-Y
. [all data]
Liu, Yang, et al., 2001
Liu, T.-T.; Yang, T.-S.; Wu, C.-M.,
Changes of volatiles in soy sauce-stewed pork during cold storage and reheating,
J. Sci. Food Agric., 2001, 81, 15, 1547-1552, https://doi.org/10.1002/jsfa.978
. [all data]
Pet'ka, Mocák, et al., 2001
Pet'ka, J.; Mocák, J.; Farkas, P.; Balla, B.; Kovác, M.,
Classification of Slovak varietal white wines by volatile compounds,
J. Sci. Food Agric., 2001, 81, 15, 1533-1539, https://doi.org/10.1002/jsfa.979
. [all data]
Shimoda, Yoshimura, et al., 2001
Shimoda, M.; Yoshimura, Y.; Yoshimura, T.; Noda, K.; Osajima, Y.,
Volatile flavor compounds of sweetened condensed milk,
J. Food Sci., 2001, 66, 6, 804-807, https://doi.org/10.1111/j.1365-2621.2001.tb15176.x
. [all data]
Verzera, Campisi, et al., 2001
Verzera, A.; Campisi, S.; Zappalá, M.; Bonaccorsi, I.,
SPME-GC-MS analysis of honey volatile components for the characterization of different floral origin,
Am. Lab. Fairfield Conn., 2001, 33, 15, 18-21. [all data]
Charles, Martin, et al., 2000
Charles, M.; Martin, B.; Ginies, C.; Etievant, P.; Coste, G.; Guichard, E.,
Potent aroma compounds of two red wine vinegars,
J. Agric. Food Chem., 2000, 48, 1, 70-77, https://doi.org/10.1021/jf9905424
. [all data]
Moio, Piombino, et al., 2000
Moio, L.; Piombino, P.; Addeo, F.,
Odour-impact compounds of Gorgonzola cheese,
J. Dairy Res., 2000, 67, 2, 273-285, https://doi.org/10.1017/S0022029900004106
. [all data]
Stephan and Steinhart, 1999
Stephan, A.; Steinhart, H.,
Identification of character impact odorants of different soybean lecithins,
J. Agric. Food Chem., 1999, 47, 7, 2854-2859, https://doi.org/10.1021/jf981387g
. [all data]
Cha, Kim, et al., 1998
Cha, Y.J.; Kim, H.; Cadwallader, K.R.,
Aroma-active compounds in Kimchi during fermentation,
J. Agric. Food Chem., 1998, 46, 5, 1944-1953, https://doi.org/10.1021/jf9706991
. [all data]
Moio and Addeo, 1998
Moio, L.; Addeo, F.,
Grana Padano cheese aroma,
J. Dairy Res., 1998, 65, 2, 317-333, https://doi.org/10.1017/S0022029997002768
. [all data]
Ott, Fay, et al., 1997
Ott, A.; Fay, L.B.; Chaintreau, A.,
Determination and origin of the aroma impact compounds of yogurt flavor,
J. Agric. Food Chem., 1997, 45, 3, 850-858, https://doi.org/10.1021/jf960508e
. [all data]
Shimoda, Nakada, et al., 1997
Shimoda, M.; Nakada, Y.; Nakashima, M.; Osajima, Y.,
Quantitative comparison of volatile flavor compounds in deep-roasted and light-roasted sesame seed oil,
J. Agric. Food Chem., 1997, 45, 8, 3193-3196, https://doi.org/10.1021/jf970172o
. [all data]
Shimoda, Shiratsuchi, et al., 1996
Shimoda, M.; Shiratsuchi, H.; Nakada, Y.; Wu, Y.; Osajima, Y.,
Identification and sensory characterization of volatile flavor compounds in sesame seed oil,
J. Agric. Food Chem., 1996, 44, 12, 3909-3912, https://doi.org/10.1021/jf960115f
. [all data]
Shimoda, Wu, et al., 1996
Shimoda, M.; Wu, Y.; Osajima, Y.,
Aroma compounds from aqueous solution of Haze (Rhus succedanea) honey determined by adsorptive column chromatography,
J. Agric. Food Chem., 1996, 44, 12, 3913-3918, https://doi.org/10.1021/jf9601168
. [all data]
Shimoda, Shigematsu, et al., 1995
Shimoda, M.; Shigematsu, H.; Shiratsuchi, H.; Osajima, Y.,
Comparison of the odor concentrates by SDE and adsorptive column method from green tea infusion,
J. Agric. Food Chem., 1995, 43, 6, 1616-1620, https://doi.org/10.1021/jf00054a037
. [all data]
Shimoda, Shigematsu, et al., 1995, 2
Shimoda, M.; Shigematsu, H.; Shiratsuchi, H.; Osajima, Y.,
Comparison of volatile compounds among different grades of green tea and their relations to odor attributes,
J. Agric. Food Chem., 1995, 43, 6, 1621-1625, https://doi.org/10.1021/jf00054a038
. [all data]
Iwaoka, Hagi, et al., 1994
Iwaoka, W.; Hagi, Y.; Umano, K.; Shibamoto, T.,
Volatile chemicals identified in fresh and cooked breadfruit,
J. Agric. Food Chem., 1994, 42, 4, 975-976, https://doi.org/10.1021/jf00040a026
. [all data]
Shiratsuchi, Shimoda, et al., 1994
Shiratsuchi, H.; Shimoda, M.; Imayoshi, K.; Noda, K.; Osajima, Y.,
Volatile flavor compounds in spray-dried skim milk powder,
J. Agric. Food Chem., 1994, 42, 4, 984-988, https://doi.org/10.1021/jf00040a028
. [all data]
Shiratsuchi, Shimoda, et al., 1993
Shiratsuchi, H.; Shimoda, M.; Minegishi, Y.; Osajima, Y.,
Isolation and identification of volatile flavor compounds in nonfermented coarse-cut sausage. Flavor as a quality factor of nonfermented sausage. 1,
J. Agric. Food Chem., 1993, 41, 4, 647-652, https://doi.org/10.1021/jf00028a027
. [all data]
Umano, Hagi, et al., 1992
Umano, K.; Hagi, Y.; Nakahara, K.; Shoji, A.; Shibamoto, T.,
Volatile constituents of green and ripened pineapple (Aanas comosus [L.] Merr.),
J. Agric. Food Chem., 1992, 40, 4, 599-603, https://doi.org/10.1021/jf00016a014
. [all data]
Krammer, Winterhalter, et al., 1991
Krammer, G.; Winterhalter, P.; Schwab, M.; Schreier, P.,
Glycosidically bound aroma compounds in the fruits of Prunus species: Apricot (P. armeniaca, L.) peach (P. persica, L.) yellow plum (P. domestica, L. ssp. Syriaca),
J. Agric. Food Chem., 1991, 39, 4, 778-781, https://doi.org/10.1021/jf00004a032
. [all data]
Pabst, Barron, et al., 1991
Pabst, A.; Barron, D.; Etiévant, P.; Schreier, P.,
Studies on the enzymatic hydrolysis of bound aroma constituents from raspberry fruit pulp,
J. Agric. Food Chem., 1991, 39, 1, 173-175, https://doi.org/10.1021/jf00001a034
. [all data]
Fröhlich, Duque, et al., 1989
Fröhlich, O.; Duque, C.; Schreier, P.,
Volatile constituents of curuba (Passiflora mollissima) fruit,
J. Agric. Food Chem., 1989, 37, 2, 421-425, https://doi.org/10.1021/jf00086a033
. [all data]
Chen, Kuo, et al., 1986
Chen, C.-C.; Kuo, M.-C.; Liu, S.-E.; Wu, C.-M.,
Volatile components of salted and pickled prunes (Prunus mume Sieb. et Zucc.),
J. Agric. Food Chem., 1986, 34, 1, 140-144, https://doi.org/10.1021/jf00067a038
. [all data]
Romeo, Ziino, et al., 2007
Romeo, V.; Ziino, M.; Giuffrrida, D.; Condurso, C.; Verzera, A.,
Flavour profile of capers (Capparis spinosa L.) from the Eolian Archipelago by HS-SPME/GC?MS,
Food Chem., 2007, 101, 3, 1272-1278, https://doi.org/10.1016/j.foodchem.2005.12.029
. [all data]
Natali N., Chinnici F., et al., 2006
Natali N.; Chinnici F.; Riponi C.,
Characterization of volatiles in extracts from oak chips obtained by accelerated solvent extraction (ASE),
J. Agric. Food Chem., 2006, 54, 21, 8190-8198, https://doi.org/10.1021/jf0614387
. [all data]
Selli, Canbas, et al., 2006
Selli, S.; Canbas, A.; Cabaroglu, T.; Erten, H.; Gunata, Z.,
Aroma components of cv. Muscat of Bornova wines and influence of skin contact treatment,
Food Chem., 2006, 94, 3, 319-326, https://doi.org/10.1016/j.foodchem.2004.11.019
. [all data]
Selli, Canbas, et al., 2006, 2
Selli, S.; Canbas, A.; Cabaroglu, T.; Erten, H.; Lepoutre, J.-P.; Gunata, Z.,
Effect of skin contact on the free and bound aroma compounds of the white wine of Vitis vinifera L. cv Narince,
Food Control, 2006, 17, 1, 75-82, https://doi.org/10.1016/j.foodcont.2004.09.005
. [all data]
Fritsch and Schieberle, 2005
Fritsch, H.T.; Schieberle, P.,
Identification based on quantitative measurements and aroma recombination of the character impact odorants in a Bavarian Pilsner-type beer,
J. Agric. Food Chem., 2005, 53, 19, 7544-7551, https://doi.org/10.1021/jf051167k
. [all data]
Ferrari, Lablanquie, et al., 2004
Ferrari, G.; Lablanquie, O.; Cantagrel, R.; Ledauphin, J.; Payot, T.; Fournier, N.; Guichard, E.,
Determination of key odorant compounds in freshly distilled cognac using GC-O, GC-MS, and sensory evaluation,
J. Agric. Food Chem., 2004, 52, 18, 5670-5676, https://doi.org/10.1021/jf049512d
. [all data]
Selli, Cabaroglu, et al., 2004
Selli, S.; Cabaroglu, T.; Canbas, A.; Erten, H.; Nurgel, C.; Lepoutre, J.P.; Gunata, Z.,
Volatile composition of red wine from cv. Kalecik Karasi grown in central Anatolia,
Food Chem., 2004, 85, 2, 207-213, https://doi.org/10.1016/j.foodchem.2003.06.008
. [all data]
Verzera, Ziino, et al., 2004
Verzera, A.; Ziino, M.; Condurso, C.; Romeo, V.; Zappala, M.,
Solid-phase microextraction and gas chromatography-mass spectrometry for rapid characterisation of semi-hard cheeses,
Anal. Bioanal. Chem., 2004, 380, 7-8, 930-936, https://doi.org/10.1007/s00216-004-2879-4
. [all data]
Boido, Lloret, et al., 2003
Boido, E.; Lloret, A.; Medina, K.; Fariña, L.; Carrau, f.; Versini, G.; Dellacassa, E.,
Aroma composition of Vitis vinifera Cv. Tannat: the typical red wine from Uruguay,
J. Agric. Food Chem., 2003, 51, 18, 5408-5413, https://doi.org/10.1021/jf030087i
. [all data]
Klesk and Qian, 2003
Klesk, K.; Qian, M.,
Aroma extract dilution analysis of Cv. Marion (Rubus spp. hyb) and Cv. Evergreen (R. Iaciniatus L.) blackberries,
J. Agric. Food Chem., 2003, 51, 11, 3436-3441, https://doi.org/10.1021/jf0262209
. [all data]
da Porto, Pizzale, et al., 2003
da Porto, C.; Pizzale, L.; Bravin, M.; Conte, L.S.,
Analyses of orange spirit flavour by direct-injection gas chromatography-mass spectrometry and headspace solid-phase microextraction/GC-MC,
Flavour Fragr. J., 2003, 18, 1, 66-72, https://doi.org/10.1002/ffj.1164
. [all data]
Nurgel, Erten, et al., 2002
Nurgel, C.; Erten, H.; Canbas, A.; Cabaroglu, T.; Selli, S.,
Contribution by Saccharomyces cerevisiae yeasts to fermentation and flavour compounds in wines from cv. Kalecik karasi grape,
J. Inst. Brew., 2002, 108, 1, 68-72, https://doi.org/10.1002/j.2050-0416.2002.tb00126.x
. [all data]
Zehentbauer and Reineccius, 2002
Zehentbauer, G.; Reineccius, G.A.,
Determination of key aroma components of cheddar cheese using dynamic headspace dilution assay,
Flavour Fragr. J., 2002, 17, 4, 300-305, https://doi.org/10.1002/ffj.1102
. [all data]
Cantergiani, Brevard, et al., 2001
Cantergiani, E.; Brevard, H.; Krebs, Y.; Feria-Morales, A.; Amadò, R.; Yeretzian, C.,
Characterisation of the aroma of green Mexican coffee and identification of mouldy/earthy defect,
Eur. Food Res. Technol., 2001, 212, 6, 648-657, https://doi.org/10.1007/s002170100305
. [all data]
Kirchhoff and Schieberle, 2001
Kirchhoff, E.; Schieberle, P.,
Determination of key aroma compounds in the crumb of a three-stage sourdough rye bread by stable isotope dilution assays and sensory studies,
J. Agric. Food Chem., 2001, 49, 9, 4304-4311, https://doi.org/10.1021/jf010376b
. [all data]
Rychlik and Bosset, 2001
Rychlik, M.; Bosset, J.O.,
Flavour and off-flavour compoundsof SwissGruy ere cheese. Evaluation of potent odorants,
Int. Dairy J., 2001, 11, 11-12, 895-901, https://doi.org/10.1016/S0958-6946(01)00108-X
. [all data]
Ziegleder, 2001
Ziegleder, G.,
Odorous compounds in paperboard as influenced by recycled material and storage,
Packag. Technol. Sci., 2001, 14, 4, 131-136, https://doi.org/10.1002/pts.541
. [all data]
Munk, Munch, et al., 2000
Munk, S.; Munch, P.; Stahnke, L.; Adler-Nissen., J.; Schieberle, P.,
Primary odorants of laundry soiled with sweat/sebum: influence of lipase on the odor profile,
Journal of Surfactants and Detergents, 2000, 3, 4, 505-515, https://doi.org/10.1007/s11743-000-0150-z
. [all data]
Kubícková and Grosch, 1997
Kubícková, J.; Grosch, W.,
Evaluation of potent odorants of camembert cheese by dilution and concentration techniques,
Int. Dairy J., 1997, 7, 1, 65-70, https://doi.org/10.1016/S0958-6946(96)00044-1
. [all data]
Yasuhara, 1987
Yasuhara, A.,
Identification of Volatile Compounds in Poultry Manure by Gas Chromatography-Mass Spectrometry,
J. Chromatogr., 1987, 387, 371-378, https://doi.org/10.1016/S0021-9673(01)94539-X
. [all data]
Fanaro, Duarte, et al., 2012
Fanaro, G.B.; Duarte, R.C.; Santillo, A.G.; Pinto e Silva, M.E.M.; Purgatto, E.; Villavicento, A.L.C.H.,
Evaluation of γ-radiation on oolong tea odor volatiles,
Radiation Phys. Chem., 2012, 81, 8, 1152-1156, https://doi.org/10.1016/j.radphyschem.2011.11.061
. [all data]
Cais-Sokolinska, Majcher, et al., 2011
Cais-Sokolinska, D.; Majcher, M.; Pikul, J.; Bielinska, S.; Czauderma, M.; Wojtowski, J.,
The effect of Camelia sativa cake diet supplementation on sensory and volatile profiles of ewe's milk,
African J. Biotechnol., 2011, 10, 37, 7245-7252. [all data]
Leffingwell and Alford, 2011
Leffingwell, J.; Alford, E.D.,
Volatile constituents of the giant pufball mushroom (Calvatia gigantea),
Leffingwell Rep., 2011, 4, 1-17. [all data]
Liu, Lu, et al., 2011
Liu, S.; Lu, S.; Su, Y.; Guo, Y.,
Analysis of volatile compounds in Radix Bupleuri injection by GC-MS-MS,
Chromatographia, 2011, 74, 5-6, 497-502, https://doi.org/10.1007/s10337-011-2082-7
. [all data]
Jerkovic, Hegic, et al., 2010
Jerkovic, I.; Hegic, G.; Marijanovic, Z.; Bubalo, D.,
Organic extractives from Mentha spp. honey and the bee-stomach: methyl syringate, vomifoliol, terpenediol I, hotrienol, and other compounds,
Molecules, 2010, 15, 4, 2911-2924, https://doi.org/10.3390/molecules15042911
. [all data]
Jerkovic and Marijanovic, 2010
Jerkovic, I.; Marijanovic, Z.,
Oak (Quercus frainetto Ten.) honeydaw honey - approach to screening of volatile organic composition and antioxidant capacity (DPPH and FRAP assay),
Molecules, 2010, 15, 5, 3744-3756, https://doi.org/10.3390/molecules15053744
. [all data]
Majcher, Lawrowski, et al., 2010
Majcher, M.; Lawrowski, P.; Jelen, H.,
Comparison of original and adulterated oscypek cheese based on volatile and sensory profiles,
Acta Sci. Pol. Technol. Aliment., 2010, 9, 3, 265-275. [all data]
Pino, Marquez, et al., 2010
Pino, J.A.; Marquez, E.; Quijano, C.E.; Castro, D.,
Volatile compounds in noni (Morinda citrifolia L.) at two ripening stages,
Ciencia e Technologia de Alimentos, 2010, 30, 1, 183-187, https://doi.org/10.1590/S0101-20612010000100028
. [all data]
Radulovic, Blagojevic, et al., 2010
Radulovic, N.; Blagojevic, P.; Palic, R.,
Comparative study of the leaf volatiles of Arctostaphylos uva-ursi (L.) Spreng. and Vaccinium vitis-idaea L. (Ericaceae),
Molecules, 2010, 15, 9, 6168-6185, https://doi.org/10.3390/molecules15096168
. [all data]
Radulovic, Dordevic, et al., 2010
Radulovic, N.; Dordevic, N.; Markovic, M.; Palic, R.,
Volatile constituents of Glechoma Hirsuta Waldst. Kit. and G. Hederacea L. (Lamiaceae),
Bull. Chem. Soc. Ethiop., 2010, 24, 1, 67-76, https://doi.org/10.4314/bcse.v24i1.52962
. [all data]
Mallia, Escher, et al., 2009
Mallia, S.; Escher, F.; Dubois, S.; Schieberle, P.; Schlichtherle-Cerny, H.,
Characterization and quantification of odor-active compounds in unsaturated fatty acid/conjugated linoleic acid (UFA/CLA)-enriched butter and in conventional butter during storage and induced oxidation,
J. Agric. Food Chem., 2009, 57, 16, 7464-7472, https://doi.org/10.1021/jf9002158
. [all data]
Radulovic, Blagojevic, et al., 2009
Radulovic, N.S.; Blagojevic, P.D.; Palic, R.M.; Zlatkovic, B.K.; Stevanovic, B.M.,
Volatiles from vegetative organs of the paleoendemic resurrection plants Ramonda serbica Panc. and Ramonda nathaliae Panc. at Petrov,
J. Serb. Chem. Soc., 2009, 74, 1, 35-44, https://doi.org/10.2298/JSC0901035R
. [all data]
Forero, Quijano, et al., 2008
Forero, M.D.; Quijano, C.E.; Pino, J.A.,
Volatile compounds of Chile pepper (Capsicum annuum L. var. glabriusculum) at two ripening stages,
Flavour Fragr. J., 2008, 24, 1, 25-30, https://doi.org/10.1002/ffj.1913
. [all data]
Mildner-Szkudlarz and Jelen, 2008
Mildner-Szkudlarz, S.; Jelen, H.H.,
The potential of different techniques for volatile compounds analysis coupled with PCA for the detection of the adulteration of olive oil with hazelnut oil,
Food Chem., 2008, 110, 3, 751-761, https://doi.org/10.1016/j.foodchem.2008.02.053
. [all data]
Saidana, Mahjoub, et al., 2008
Saidana, D.; Mahjoub, M.A.; Boussaada, O.; Chriaa, J.; Cheraif, I.; Daami, M.; Mighri, Z.; Helal, A.N.,
Chemical composition and antimicrobial activity of volatile compounds of Tamarix boveana (Tamaricaceae),
Microbiol. Res., 2008, 163, 4, 445-455, https://doi.org/10.1016/j.micres.2006.07.009
. [all data]
Thakeow, Angeli, et al., 2008
Thakeow, P.; Angeli, S.; Weissbecker, B.; Schutz, S.,
Antennal and behavioral responses of Cis boleti to fungal odor of Trametes gibbosa,
Chem. Senses, 2008, 33, 4, 379-387, https://doi.org/10.1093/chemse/bjn005
. [all data]
Jerkovic, Mastelic, et al., 2007
Jerkovic, I.; Mastelic, J.; Marijanovic, Z.,
Bound volatile compounds and essential oil from the fruit of Maclura pomifera (Raf.) Schneid. (osage orange),
Flavour Fragr. J., 2007, 22, 1, 84-88, https://doi.org/10.1002/ffj.1763
. [all data]
Ramirez R. and Cava R., 2007
Ramirez R.; Cava R.,
Volatile profiles of dry-cured meat products from three different Iberian x Duroc genotypes,
J. Agric. Food Chem., 2007, 55, 5, 1923-1931, https://doi.org/10.1021/jf062810l
. [all data]
Setkova, Risticevic, et al., 2007
Setkova, L.; Risticevic, S.; Pawliszyn, J.,
Rapid headspace solid-phase microextraction-gas chromatographic?time-of-flight mass spectrometric method for qualitative profiling of ice wine volatile fraction II: Classification of Canadian and Czech ice wines using statistical evaluation of the data,
J. Chromatogr. A, 2007, 1147, 2, 224-240, https://doi.org/10.1016/j.chroma.2007.02.052
. [all data]
Xu, Fan, et al., 2007
Xu, Y.; Fan, W.; Qian, M.C.,
Characterization of Aroma Compounds in Apple Cider Using Solvent-Assisted Flavor Evaporation and Headspace Solid-Phase Microextraction,
J. Agric. Food Chem., 2007, 55, 8, 3051-3057, https://doi.org/10.1021/jf0631732
. [all data]
Chen, Sheu, et al., 2006
Chen, H.-C.; Sheu, M.-J.; Wu, C.-M.,
Characterization of Volatiles in Guava (Psidium guajava L. cv. Chung-Shan-Yueh-Pa) Fruit from Taiwan,
J. Food Drug. Anal., 2006, 14, 4, 398-402. [all data]
Shen X., Gao Y., et al., 2006
Shen X.; Gao Y.; Su Q.D.,
Constituents of the essential oil of Rhizoma polygonati,
Flavour Fragr. J., 2006, 21, 3, 556-558, https://doi.org/10.1002/ffj.1666
. [all data]
Tzakou, Said, et al., 2006
Tzakou, O.; Said, A.; Farag, A.; Rashed, K.,
Volatile constituents of Ailanthus excelsa Roxb.,
Flavour Fragr. J., 2006, 21, 6, 899-901, https://doi.org/10.1002/ffj.1739
. [all data]
Dohou, Yamni, et al., 2005
Dohou, N.; Yamni, K.; Badoc, A.; Tahrouch, S.; Idrissi Hassani, L.M.; Bessière, J.-M.,
Composés volatils de Thymelaea lythroides, endémique, ibéro-marocaine,
Bull. Soc. Pharm. Bordeaux, 2005, 144, 63-70. [all data]
Krist, Stuebiger, et al., 2005
Krist, S.; Stuebiger, G.; Unterweger, H.; Bandion, F.; Buchbauer, G.,
Analysis of volatile compounds and triglycerides of seed oils extracted from different poppy varieties (Papaver somniferum L.),
J. Agric. Food Chem., 2005, 53, 21, 8310-8316, https://doi.org/10.1021/jf0580869
. [all data]
van Loon, Linssen, et al., 2005
van Loon, W.A.M.; Linssen, J.P.H.; Legger, A.; Posthumus, M.A.; Voragen, A.G.J.,
Identification and olfactometry of French fries flavour extracted at mouth conditions,
Food Chem., 2005, 90, 3, 417-425, https://doi.org/10.1016/j.foodchem.2004.05.005
. [all data]
Ramírez, Estévez, et al., 2004
Ramírez, M.R.; Estévez, M.; Morcuende, D.; Cava, R.,
Effect of the type of frying culinary fat on volatile compounds isolated in fried pork loin chops by using SPME-GC-MS,
J. Agric. Food Chem., 2004, 52, 25, 7637-7643, https://doi.org/10.1021/jf049207s
. [all data]
Ledauphin, Guichard, et al., 2003
Ledauphin, J.; Guichard, H.; Saint-Clair, J.-F.; Picoche, B.; Barillier, D.,
Chemical and sensorial aroma characterization of freshly distilled calvados. 2. Identification of volatile compounds and key odorants,
J. Agric. Food Chem., 2003, 51, 2, 433-442, https://doi.org/10.1021/jf020373e
. [all data]
Mildner-Szkudlarz, Jelen, et al., 2003
Mildner-Szkudlarz, S.; Jelen, H.H.; Zawirska-Wojtasiak, R.; Wasowicz, E.,
Application of headspace - solid phase microextraction and multivariate analysis for plant oils differentiation,
Food Chem., 2003, 83, 4, 515-522, https://doi.org/10.1016/S0308-8146(03)00147-X
. [all data]
Sebastian, Viallon-Fernandez, et al., 2003
Sebastian, I.; Viallon-Fernandez, C.; Berge, P.; Berdague, J.-L.,
Analysis of the volatile fraction of lamb fat tissue: influence of the type of feeding,
Sciences des Aliments, 2003, 23, 4, 497-511, https://doi.org/10.3166/sda.23.497-511
. [all data]
Jirovetz, Smith, et al., 2002
Jirovetz, L.; Smith, D.; Buchbauer, G.,
Aroma compound analysis of Eruca sativa (Brassicaceae) SPME headspace leaf samples using GC, GC-MS, and olfactometry,
J. Agric. Food Chem., 2002, 50, 16, 4643-4646, https://doi.org/10.1021/jf020129n
. [all data]
Pino, Marbot, et al., 2002, 3
Pino, J.A.; Marbot, R.; Vazquez, C.,
Characterization of volatiles in Loquat fruit (Eriobotrya japonica Lindl.),
Revista CENIC Ciencias Quimicas, 2002, 33, 3, 115-119. [all data]
Sies A., Hirsch R., et al., 2002
Sies A.; Hirsch R.; Löscher R.; Tablack P.; Guth H.,
Direct thermal desorption and Fast-GC-TOF-MS for a rapid quality control of hazelnuts, 10th Weurman Flavour Research Symposium, 24 - 28 June 2002, Beaune, France, 2002. [all data]
Brun, Bessière, et al., 2001
Brun, G.; Bessière, J.-M.; Dijoux-Franca, M.-G.; David, B.; Mariotte, A.-M.,
Volatile components of Catharanthus roseus (L.) G. Don (Apocynaceae),
Flavour Fragr. J., 2001, 16, 2, 116-119, https://doi.org/10.1002/ffj.958
. [all data]
Friedrich, Acree, et al., 2001
Friedrich, J.E.; Acree, T.E.; Lavin, E.H.,
Selecting standards for gas chromatography - olfactometry,
Am. Chem. Soc. Symp. Ser., 2001, 782, 148-155. [all data]
de Beck, Bessière, et al., 2000
de Beck, P.O.; Bessière, J.M.; Dijoux-Franca, M.-G.; David, B.; Mariotte, A.-M.,
Volatile constituents from leaves and wood of Leea guineensis G. Don (Leeaceae) from Cameroon,
Flavour Fragr. J., 2000, 15, 3, 182-185, https://doi.org/10.1002/1099-1026(200005/06)15:3<182::AID-FFJ888>3.0.CO;2-X
. [all data]
Kotseridis and Baumes, 2000
Kotseridis, Y.; Baumes, R.,
Identification of impact odorants in Bordeaux red grape juice, in the commercial yeast used for its fermentation, and in the produced wine,
J. Agric. Food Chem., 2000, 48, 2, 400-406, https://doi.org/10.1021/jf990565i
. [all data]
Tamura, Boonbumrung, et al., 2000
Tamura, H.; Boonbumrung, S.; Yoshizawa, T.; Varanyanond, W.,
Volatile components of the essential oil in the pulp of four yellow mangoes (Mangifera indica L.) in Thailand,
Food Sci. Technol. Res., 2000, 6, 1, 68-73, https://doi.org/10.3136/fstr.6.68
. [all data]
Lopez, Ferreira, et al., 1999
Lopez, R.; Ferreira, V.; Hernandez, P.; Cacho, J.F.,
Identification of impact odorants of young red wines made with Merlot, Cabernet Sauvignon and Grenache grape varieties: a comparative study,
J. Sci. Food Agric., 1999, 79, 11, 1461-1467, https://doi.org/10.1002/(SICI)1097-0010(199908)79:11<1461::AID-JSFA388>3.0.CO;2-K
. [all data]
Doneanu and Anitescu, 1998
Doneanu, C.; Anitescu, G.,
Supercritical carbon dioxide extraction of Angelica archangelica L. root oil,
J. Supercrit. Fluids, 1998, 12, 1, 59-67, https://doi.org/10.1016/S0896-8446(97)00040-5
. [all data]
Fons, Rapior, et al., 1998
Fons, F.; Rapior, S.; Gargadennec, A.; Andary, C.; Bessiere, J.-M.,
Volatile components of Plantago lanceolata (Plantaginaceae),
Acta bot. Gallica, 1998, 145, 4, 265-269, https://doi.org/10.1080/12538078.1998.10516306
. [all data]
Ong and Acree, 1998
Ong, P.K.C.; Acree, T.E.,
Gas chromatography/olfactory analysis of lychee (Litchi chinesis Sonn.),
J. Agric. Food Chem., 1998, 46, 6, 2282-2286, https://doi.org/10.1021/jf9801318
. [all data]
Ong, Acree, et al., 1998
Ong, P.K.C.; Acree, T.E.; Lavin, E.H.,
Characterization of volatiles in rambutan fruit (Nephelium lappaceum L.),
J. Agric. Food Chem., 1998, 46, 2, 611-615, https://doi.org/10.1021/jf970665t
. [all data]
Buttery, Ling, et al., 1997
Buttery, R.G.; Ling, L.C.; Stern, D.J.,
Studies on popcorn aroma and flavor volatiles,
J. Agric. Food Chem., 1997, 45, 3, 837-843, https://doi.org/10.1021/jf9604807
. [all data]
King, Matthews, et al., 1995
King, M.-F.; Matthews, M.A.; Rule, D.C.; Field, R.A.,
Effect of beef packaging method on volatile compounds developed by oven roasting or microwave cooking,
J. Agric. Food Chem., 1995, 43, 3, 773-778, https://doi.org/10.1021/jf00051a039
. [all data]
King, Hamilton, et al., 1993
King, M.-F.; Hamilton, B.L.; Matthews, M.A.; Rule, D.C.; Field, R.A.,
Isolation and identification of volatiles and condensable material in raw beef with supercritical carbon dioxide extraction,
J. Agric. Food Chem., 1993, 41, 11, 1974-1981, https://doi.org/10.1021/jf00035a030
. [all data]
Buttery, Teranishi, et al., 1990
Buttery, R.G.; Teranishi, R.; Ling, L.C.; Turnbaugh, J.G.,
Quantitative and sensory studies on tomato paste volatiles,
J. Agric. Food Chem., 1990, 38, 1, 336-340, https://doi.org/10.1021/jf00091a074
. [all data]
Jantan and Goh, 1990
Jantan, I.; Goh, S.H.,
The essential oils of Cinnamomum mollissimum as natural sources of safrole and benzyl benzoate,
J. Tropical Forest Sci., 1990, 2, 3, 252-259. [all data]
Flath, Matsumoto, et al., 1989
Flath, R.A.; Matsumoto, K.E.; Binder, R.G.; Cunningham, R.T.; Mon, T.R.,
Effect of pH on the volatiles of hydrolyzed protein insect baits,
J. Agric. Food Chem., 1989, 37, 3, 814-819, https://doi.org/10.1021/jf00087a053
. [all data]
Habu, Flath, et al., 1985
Habu, T.; Flath, R.A.; Mon, T.R.; Morton, J.F.,
Volatile components of Rooibos tea (Aspalathus linearis),
J. Agric. Food Chem., 1985, 33, 2, 249-254, https://doi.org/10.1021/jf00062a024
. [all data]
Albano, Lima, et al., 2012
Albano, S.M.; Lima, A.S.; Miguel, M.G.; Pedro, L.G.; Barroso, J.G.; Figueiredo, A.C.,
Antioxidant, anti-5-lipoxygenase and antiacetylcholinesterase activities of essential oils and decoction water of some aromatic plants,
Rec. Nat. Prod., 2012, 6, 1, 35-48. [all data]
Collin, Nizet, et al., 2012
Collin, S.; Nizet, S.; Gros, J.,
Le houblonnage a cru des bieres speciales belges est bien plus qu'une simple dissolution des composes aromatiques du houblon (in Flamish),
Cerevisia, 2012, 36, 4, 119-124, https://doi.org/10.1016/j.cervis.2011.12.001
. [all data]
Collin, Nizet, et al., 2012, 2
Collin, S.; Nizet, S.; Bouuaert, T.C.; Despartures, P.-M.,
MAin odorants in Jura Flor-Sherry wines. Relative contributions of sotolon, abhexon, and theaspirane-derived compounds,
J. Agr. Food Chem., 2012, 60, 1, 380-381, https://doi.org/10.1021/jf203832c
. [all data]
Mondello, 2012
Mondello, L.,
HS-SPME-GCxGC-MS analysis of Yerba Mate (Ilex paraguariensis)
in Shimadzu GC-GC application compendium of comprehensive 2D GC, Vol. 1-5, Shimadzu Corp., 2012, 1-29. [all data]
VOC BinBase, 2012
VOC BinBase,
The volatile compound BinBase (VOC BinBase), 2012, retrieved from http://fiehnlab.ucdavis.edu/projects/VocBinBase and http://binbase.sourceforge.net. [all data]
Miyazaki, Plotto, et al., 2011
Miyazaki, T.; Plotto, A.; Goodner, K.; Gmitter F.G.,
Distribution of aroma volatile compounds in tangerine hybrids and proposed inheritance,
J. Sci. Food Agric., 2011, 91, 3, 449-460, https://doi.org/10.1002/jsfa.4205
. [all data]
Skogerson, Wohlgemuth, et al., 2011
Skogerson, K.; Wohlgemuth, G.; Fiehn, O.,
VocBinNase, 2011, retrieved from http://fiehnlab.ucdavis.edu/projects//VocBinBase. [all data]
Al-Reza, Rahman, et al., 2010
Al-Reza, S.M.; Rahman, A.; Lee, J.; Kang, S.C.,
Potential roles of essential oil and organic extracts of Zizyphus jujuba in inhibiting food-borne pathogens,
Food Chem., 2010, 119, 3, 981-986, https://doi.org/10.1016/j.foodchem.2009.07.059
. [all data]
Fan, Lu, et al., 2009
Fan, G.; Lu, W.; Yao, X.; Zhang, Y.; Wang, K.; Pan, S.,
effect of fermentation on free and bound volatile compounds of orange juice,
Flavour Fragr. J., 2009, 24, 5, 219-229, https://doi.org/10.1002/ffj.1931
. [all data]
Mebazaa, Mahmoudi, et al., 2009
Mebazaa, R.; Mahmoudi, A.; Fouchet, M.; Dos Santos, M.; Kamissoko, F.; Nafti, A.; Ben Cheikh, R.; Rega, B.; Camel, V.,
Characterization of volatile compounds in Tunisian fenugreek seeds,
Food Chem., 2009, 115, 4, 1326-1336, https://doi.org/10.1016/j.foodchem.2009.01.066
. [all data]
Pugliese, Sirtori, et al., 2009
Pugliese, C.; Sirtori, F.; Ruiz, J.; Martin, D.; Parenti, S.; Franci, O.,
Effect of pasture on chestnut or acorn on fatty acid composition and aromatic profile of fat of China Senece dry-cured ham,
Gracas y Aceites, 2009, 60, 3, 271-276, https://doi.org/10.3989/gya.130208
. [all data]
Nogueira, Marcelo-Curto, et al., 2008
Nogueira, T.; Marcelo-Curto, M.J.; Cristina Figueiredo, A.; Barroso, J.G.; Pedro, L.G.; Rubiolo, P.; Bicchi, C.,
Chemotaxonomy of Hypericum genus from Portugal: Geographical distribution and essential oils composition of Hypericum perfoliatum, Hypericum humifusum, Hypericum linarifolium and Hypericum pulchrum,
Biochem. Syst. Ecol., 2008, 36, 1, 40-50, https://doi.org/10.1016/j.bse.2007.07.004
. [all data]
Ventanas, Estevez, et al., 2008
Ventanas, S.; Estevez, M.; Andres, A.I.; Ruiz, J.,
Analysis of volatile compounds of Iberian dry-cured loins with different intramuscular fat contents using SPME-DED,
Meat Sci., 2008, 79, 1, 172-180, https://doi.org/10.1016/j.meatsci.2007.08.011
. [all data]
Zhao, Li, et al., 2008
Zhao, Y.; Li, J.; Xu, Y.; Duan, H.; Fan, W.; Zhao, G.,
EXtraction, preparation and identification of volatile compounds in Changyu XO brandy,
Chinese J. Chromatogr., 2008, 26, 2, 212-222, https://doi.org/10.1016/S1872-2059(08)60014-0
. [all data]
Borse, Rao, et al., 2007
Borse, B.B.; Rao, L.J.M.; Ramalaksmi, K.; Raghavan, B.,
Chemical composition of volatiles from coconut sap (neera) end effect of processing,
Food Chem., 2007, 101, 3, 877-880, https://doi.org/10.1016/j.foodchem.2006.02.026
. [all data]
Bosch-Fuste, Riu-Aumatell, et al., 2007
Bosch-Fuste, J.; Riu-Aumatell, M.; Guadayol, J.M.; Caixach, J.; Lopez-Tamames, E.; Buxaderas, S.,
Volatile profiles of sparkling wines obtained by three extraction methods and gas chromatography-mass spectrometry (GC-MS) analysis,
Food Chem., 2007, 105, 1, 428-435, https://doi.org/10.1016/j.foodchem.2006.12.053
. [all data]
Liu, Xu, et al., 2007
Liu, Y.; Xu, X.-L.; Zhou, G.-H.,
Comparative study of volatile compounds in traditional Chinese Nanjing marinated duck by different extraction techniques,
Int. J. Food Sci. Technol., 2007, 42, 5, 543-550, https://doi.org/10.1111/j.1365-2621.2006.01264.x
. [all data]
Mallia, Escher, et al., 2007
Mallia, S.; Escher, F.; Rehberger, B.; Schlichtherle-Cerny, H.,
Aroma-active secondary oxidation products of butter, 3rd QLIF Congress, Hohenheim, Germany, March 20-23, 2007, 2007, retrieved from http://orgprints.org/view/projects/intconfqlif2007.html; http://orgprints.org/9734/. [all data]
Nivinsliene, Butkiene, et al., 2007
Nivinsliene, O.; Butkiene, R.; Gudalevic, A.; Mockute, D.; Meskauskiene, V.; Grigaliunaite, B.,
Influence of urban environment on chemical composition of Tilia cordata essential oil,
Chemija, 2007, 18, 1, 44-49. [all data]
Pellicer, 2007
Pellicer, L.V.,
Comparison of Sensory Characteristics, and Instrumental flavor Compounds Analysis of Milk Produced by Three Proction Methods. A Thesis presented to the Faculty of the Graduate School University of Missouri-Columbia, 2007, retrieved from http://edit.missouri,edu/Winter2007/Theses/ValverdePellicerL-053107-T6722/research.pdf. [all data]
Alissandrakis, Kibaris, et al., 2005
Alissandrakis, E.; Kibaris, A.C.; Tarantilis, P.A.; Harizanis, P.C.; Polissiou, M.,
Flavour compounds of Greek cotton honey,
J. Sci. Food Agric., 2005, 85, 9, 1444-1452, https://doi.org/10.1002/jsfa.2124
. [all data]
Hamm, Bleton, et al., 2005
Hamm, S.; Bleton, J.; Connan, J.; Tchapla, A.,
A chemical investigation by headspace SPME and GC-MS of volatile and semi-volatile terpenes in various olibanum samples,
Phytochemistry, 2005, 66, 12, 1499-1514, https://doi.org/10.1016/j.phytochem.2005.04.025
. [all data]
Escudero, Gogorza, et al., 2004
Escudero, A.; Gogorza, B.; Melús, M.A.; Ortín, N.; Cacho, J.; Ferreira, V.,
Characterization of the aroma of a wine from Maccabeo. Key role played by compounds with low odor activity values,
J. Agric. Food Chem., 2004, 52, 11, 3516-3524, https://doi.org/10.1021/jf035341l
. [all data]
Garcia-Estaban, Ansorena, et al., 2004
Garcia-Estaban, M.; Ansorena, D.; Astiasaran, I.; Martin, D.; Ruiz, J.,
Comparison of simultaneous distillation extraction (SDE) and solid-phase microextraction (SPME) for the analysis of volatile compounds in dry-cured ham,
J. Sci. Food Agric., 2004, 84, 11, 1364-1370, https://doi.org/10.1002/jsfa.1826
. [all data]
Garcia-Estaban, Ansorena, et al., 2004, 2
Garcia-Estaban, M.; Ansorena, D.; Astiasarán, I.; Ruiz, J.,
Study of the effect of different fiber coatings and extraction conditions on dry cured ham volatile compounds extracted by solid-phase microextraction (SPME),
Talanta, 2004, 64, 2, 458-466, https://doi.org/10.1016/j.talanta.2004.03.007
. [all data]
Vinogradov, 2004
Vinogradov, B.A.,
Production, composition, properties and application of essential oils, 2004, retrieved from http://viness.narod.ru. [all data]
Alves and Franco, 2003
Alves, G.L.; Franco, M.R.B.,
Headspace gas chromatography-mass spectrometry of volatile compounds in murici (Byrsonima crassifolia L. Rich),
J. Chromatogr. A, 2003, 985, 1-2, 297-301, https://doi.org/10.1016/S0021-9673(02)01398-5
. [all data]
Begnaud, Pérès, et al., 2003
Begnaud, F.; Pérès, C.; Berdagué, J.-L.,
Characterization of volatile effluents of livestock buildings by solid-phase microextraction,
Int. J. Environ. Anal. Chem., 2003, 83, 10, 837-849, https://doi.org/10.1080/03067310310001603349
. [all data]
Demyttenaere, Dagher, et al., 2003
Demyttenaere, J.C.R.; Dagher, C.; Sandra, P.; Kallithraka, S.; Verhé, R.; de Kimpe, N.,
Flavour analysis of Greek white wine by solid-phase microextraction-capillary gas chromatography-mass spectrometry,
J. Chromatogr. A, 2003, 985, 1-2, 233-246, https://doi.org/10.1016/S0021-9673(02)01467-X
. [all data]
Jordán, Margaría, et al., 2003
Jordán, M.J.; Margaría, C.A.; Shaw, P.E.; Goodner, K.L.,
Volatile components and aroma active compounds in aqueous essence and fresh pink guava fruid puree (Psidium guajava L.) by GC-MS and multidimensional GC/GC-O,
J. Agric. Food Chem., 2003, 51, 5, 1421-1426, https://doi.org/10.1021/jf020765l
. [all data]
Machiels, van Ruth, et al., 2003
Machiels, D.; van Ruth, S.M.; Posthumus, M.A.; Istasse, L.,
Gas chromatography-olfactometry analysis of the volatile compounds of two commercial Irish beef meats,
Talanta, 2003, 60, 4, 755-764, https://doi.org/10.1016/S0039-9140(03)00133-4
. [all data]
Demyttenaere, Dagher, et al., 2002
Demyttenaere, J.C.R.; Dagher, C.; Verhé, R.; Sandra, P.,
Flavour analysis of Greek white wine using solid phase microextraction - capillary GC/MS
in 25th International Symposium on Capillary Chromatography, 2002, 1-16. [all data]
Ferreira, Ortín, et al., 2002
Ferreira, V.; Ortín, N.; Escudero, A.; López, R.; Cacho, J.,
Chemical characterization of the aroma of grenache Rosé wines: aroma extract dilution analysis, quantitative determination, and sensory reconstitution studies,
J. Agric. Food Chem., 2002, 50, 14, 4048-4054, https://doi.org/10.1021/jf0115645
. [all data]
Jordán, Goodner, et al., 2002
Jordán, M.J.; Goodner, K.L.; Shaw, P.E.,
Characterization of the aromatic profile in aqueous essence and fruit juice of yellow passion fruit (Passiflora edulis Sims F. Flavicarpa degner) by GC-MS and GC/O,
J. Agric. Food Chem., 2002, 50, 6, 1523-1528, https://doi.org/10.1021/jf011077p
. [all data]
Ansorena, Gimeno, et al., 2001
Ansorena, D.; Gimeno, O.; Astiasarán, I.; Bello, J.,
Analysis of volatile compounds by GC-MS of a dry fermented sausage: chorizo de Pamplona,
Food Res. Int., 2001, 34, 1, 67-75, https://doi.org/10.1016/S0963-9969(00)00133-2
. [all data]
Aznar, López, et al., 2001
Aznar, M.; López, R.; Cacho, J.F.; Ferreira, V.,
Identification and quantification of impact odorants of aged red wines from Rioja. GC-olfactometry, quantitative GC-MS, and odor evaluation of HPLC fractions,
J. Agric. Food Chem., 2001, 49, 6, 2924-2929, https://doi.org/10.1021/jf001372u
. [all data]
Ferreira, Aznar, et al., 2001
Ferreira, V.; Aznar, M.; López, R.; Cacho, J.,
Quantitative gas chromatography-olfactometry carried out at different dilutions of an extract. Differences in the odor profiles of four high-quality spanish aged red wines,
J. Agric. Food Chem., 2001, 49, 10, 4818-4824, https://doi.org/10.1021/jf010283u
. [all data]
Teai, Claude-Lafontaine, et al., 2001
Teai, T.; Claude-Lafontaine, A.; Schippa, C.; Cozzolino, F.,
Volatile compounds in fresh pulp of pineapple (Ananas comosus [L.] Merr.) from French Polynesia,
J. Essent. Oil Res., 2001, 13, 5, 314-318, https://doi.org/10.1080/10412905.2001.9712222
. [all data]
Ansorena, Astiasarán, et al., 2000
Ansorena, D.; Astiasarán, I.; Bello, J.,
Influence of the simultaneous addition of the protease flavourzyme and the lipase novozyme 677BG on dry fermented sausage compounds extracted by SDE and analyzed by GC-MS,
J. Agric. Food Chem., 2000, 48, 6, 2395-2400, https://doi.org/10.1021/jf990931y
. [all data]
Guyot, Bouseta, et al., 1998
Guyot, C.; Bouseta, A.; Scheirman, V.; Collin, S.,
Floral origin markers of chestnut and lime tree honeys,
J. Agric. Food Chem., 1998, 46, 2, 625-633, https://doi.org/10.1021/jf970510l
. [all data]
Kawasaki, Matsui, et al., 1998
Kawasaki, W.; Matsui, K.; Akakabe, Y.; Itai, N.; Kajiwara, T.,
Long-chain aldehyde-forming activity in tobacco leaves,
Phytochemistry, 1998, 49, 6, 1565-1568, https://doi.org/10.1016/S0031-9422(98)00236-2
. [all data]
Matsui, Guth, et al., 1998
Matsui, T.; Guth, H.; Grosch, W.,
A comparative study of potent odorants in peanut, hazelnut, and pumpkin seed oils on the basis of aroma extract dilution analysis (AEDA) and gas chromatography-olfactometry of headspace samples (GCOH),
Lipid - Fett, 1998, 100, 2, 51-56, https://doi.org/10.1002/(SICI)1521-4133(199802)100:2<51::AID-LIPI51>3.0.CO;2-W
. [all data]
Timón, Ventanas, et al., 1998
Timón, M.L.; Ventanas, J.; Martín, L.; Tejeda, J.F.; García, C.,
Volatile compounds in supercritical carbon dioxide extracts of Iberian ham,
J. Agric. Food Chem., 1998, 46, 12, 5143-5150, https://doi.org/10.1021/jf980652v
. [all data]
Schermann and Schieberle, 1997
Schermann, P.; Schieberle, P.,
Evaluation of key odorants in milk chocolate and cocoa mass by aroma extract dilution analyses,
J. Agric. Food Chem., 1997, 45, 3, 867-872, https://doi.org/10.1021/jf960670h
. [all data]
Buchbauer, Nikiforov, et al., 1994
Buchbauer, G.; Nikiforov, A.; Remberg, B.,
Headspace constituents of opium,
Planta Medica, 1994, 60, 2, 181-183, https://doi.org/10.1055/s-2006-959447
. [all data]
Ciccioli, Cecinato, et al., 1994
Ciccioli, P.; Cecinato, A.; Brancaleoni, E.; Brachetti, A.; Frattoni, M.; Sparapani, R.,
Composition and Distribution of Polar and Non-Polar VOCs in Urban, Rural, Forest and Remote Areas,
Eur Commission EUR, 1994, 549-568. [all data]
Ciccioli, Brancaleoni, et al., 1993
Ciccioli, P.; Brancaleoni, E.; Cecinato, A.; Sparapani, R.; Frattoni, M.,
Identification and determination of biogenic and anthropogenic volatile organic compounds in forest areas of Northern and Southern Europe and a remote site of the Himalaya region by high-resolution gas chromatography-mass spectrometry,
J. Chromatogr., 1993, 643, 1-2, 55-69, https://doi.org/10.1016/0021-9673(93)80541-F
. [all data]
Um, Bailey, et al., 1992
Um, K.W.; Bailey, M.E.; Clarke, A.D.; Chao, R.R.,
Concentration and identification of volatile compounds from heated beef fat using supercritical CO2 extraction-gas liquid chromatography/mass spectrometry,
J. Agric. Food Chem., 1992, 40, 9, 1641-1646, https://doi.org/10.1021/jf00021a033
. [all data]
Suzuki and Bailey, 1985
Suzuki, J.; Bailey, M.E.,
Direct sampling capillary GLC analysis of flavor volatiles from ovine fat,
J. Agric. Food Chem., 1985, 33, 3, 343-347, https://doi.org/10.1021/jf00063a006
. [all data]
Wanakhachornkrai and Lertsiri, 9999
Wanakhachornkrai, P.; Lertsiri, S.,
Comparison of determination method for volatile compounds in Thai soy sauce,
Analytical, Nutritional and Clinical Methods, 9999, 1-11. [all data]
Piyachaiseth, Jirapakkul, et al., 2011
Piyachaiseth, T.; Jirapakkul, W.; Chaiseri, S.,
Aroma compounds of flash-fried rice,
Kasetsart J. (Nat. Sci.), 2011, 45, 717-729. [all data]
Duarte, Dias, et al., 2010
Duarte, W.F.; Dias, D.R.; Oliveira, J.M.; Teixeira, J.A.; de Almeida e Silva, J.B.; Schwan, R.F.,
Characterization of different fruit wines made from cacao,cupuassu, gabiroba, jaboticaba and umbu,
Food Sci. Technol., 2010, 43, 1564-1572. [all data]
Kumazawa, Sakai, et al., 2010
Kumazawa, K.; Sakai, N.; Amma, H.; Sakamoto, S.; Kodama, M.; Wada, Y.; Nishimura, O.,
Identification and formation of volatile components responsible for the characteristic aroma of Mat Rush (Igusa),
Biosci. Biotechnol. Biochem., 2010, 74, 6, 1231-1236, https://doi.org/10.1271/bbb.100053
. [all data]
Moon and Shibamoto, 2010
Moon, J.-K.; Shibamoto, T.,
Formation of volatile chemicals from thermal degradation of less volatile cofee components: quinic acid, caffeic acid, and chlorogenic acid,
J. Agric. Food Chem., 2010, 58, 9, 5465-5470, https://doi.org/10.1021/jf1005148
. [all data]
Birtic, Ginies, et al., 2009
Birtic, S.; Ginies, C.; Causse, M.; Renard, C.M.G.C.; Page, D.,
Changes in volatiles and glycosides during fruit maturartion of two contrasted tomato (Solanum lycopersicum) lines,
J. Agric. Food Chem., 2009, 57, 2, 591-598, https://doi.org/10.1021/jf8023062
. [all data]
Mo, Fan, et al., 2009
Mo, X.; Fan, W.; Xu, Y.,
Changes in volatile compounds of Chinese rice wine wheat qu during fermentation and storage,
J. of the Institute of Brewing, 2009, 115, 4, 300-307, https://doi.org/10.1002/j.2050-0416.2009.tb00385.x
. [all data]
Blazevic and Mastelic, 2008
Blazevic, I.; Mastelic, J.,
Free and bounded volatiles of rocket (Eruca sativa Mill.),
Fravour Fragr. J., 2008, 23, 4, 278-285, https://doi.org/10.1002/ffj.1883
. [all data]
Caldeira, de Sousa, et al., 2008
Caldeira, I.; de Sousa, R.B.; Balchior, A.P.; Climaco, M.C.,
A sensory and chemical approach to the aroma of wooden aged Lourinha wine brandy,
Ciencia Tec. Vitiv., 2008, 23, 2, 97-110. [all data]
Guo, Wu, et al., 2008
Guo, L.; Wu, J.-Z.; Han, T.; Cao, T.; Rahman, K.; Qin, L.-P.,
Chemical composition, antifungal and antitumor properties of ether extracts of Scapania verrucosa Heeg. and its endophytic fungus Chaetomium fusiforme,
Molecules, 2008, 13, 9, 2114-2125, https://doi.org/10.3390/molecules13092114
. [all data]
Soria, Sanz, et al., 2008
Soria, A.C.; Sanz, J.; Martinez-Castro, I.,
SPME followed by GC-MS: a powerful technique for qualitative analysis of honey volatiles,
Eur. Food Res. Technol., 2008, 1-12. [all data]
Audino, Alzogaray, et al., 2007
Audino, P.G.; Alzogaray, R.A.; Vassena, C.; Masuh, H.; Fontán, A.; Gatti, P.; Martínez, A.; Camps, F.; Cork, A.; Zerba, E.,
Volatile compounds secreted by Brindley's glands of adult Triatoma infestans: identification and biological activity of previously unidentified compounds,
Journal of Vector Ecology, 2007, 32, 1, 75-82, https://doi.org/10.3376/1081-1710(2007)32[75:VCSBBO]2.0.CO;2
. [all data]
Cros, Vandanjon, et al., 2007
Cros, S.; Vandanjon, L.; Jaouen, P.; Bourseau, P.,
Processing of Industrial Mussel Cooking Juices by Reverse Osmotis: Pollution Abatement and Aromas Recovery, 2007, retrieved from title of Internet file: [imstec064]. [all data]
Dury-Brun, Fournier, et al., 2007
Dury-Brun, C.; Fournier, N.; Pernin, K.; Guichard, E.; Voilley, A.,
A new approach to studying sponge cake aroma after storage in treated paper and plastic packaging by direct gas chromatography?olfactometry (D-GC-O),
Flavour Fragr. J., 2007, 22, 4, 255-264, https://doi.org/10.1002/ffj.1788
. [all data]
Povolo, Contarini, et al., 2007
Povolo, M.; Contarini, G.; Mele, M.; Secchiari, P.,
Study on the influence of pasture on volatile fraction of Ewes' dairy products by solid-phase microextraction and gas chromatography-mass spectrometry,
J. Dairy Sci., 2007, 90, 2, 556-569, https://doi.org/10.3168/jds.S0022-0302(07)71539-4
. [all data]
Prososki, Etzel, et al., 2007
Prososki, R.A.; Etzel, M.R.; Rankin, S.A.,
Solvent type affects the number, distribution, and relative quantities of volatile compounds found in sweet whey powder,
J. Dairy Sci., 2007, 90, 2, 523-531, https://doi.org/10.3168/jds.S0022-0302(07)71535-7
. [all data]
Rawat, Gulati, et al., 2007
Rawat, R.; Gulati, A.; Babu, G.D.K.; Acharya, R.; Kaul, V.K.; Singh, B.,
Characterization of volatile components of Kangra orthodox black tea by gas chromatography-mass spectrometry,
Food Chem., 2007, 105, 1, 229-235, https://doi.org/10.1016/j.foodchem.2007.03.071
. [all data]
Fan and Qian, 2006
Fan, W.; Qian, M.C.,
Characterization of Aroma Compounds of Chinese Wuliangye and Jiannanchun Liquors by Aroma Extract Dilution Analysis,
J. Agric. Food Chem., 2006, 54, 7, 2695-2704, https://doi.org/10.1021/jf052635t
. [all data]
Fan and Qian, 2006, 2
Fan, W.; Qian, M.C.,
Identification of aroma compounds in Chinese 'Yanghe Daqu' liquor by normal phase chromatography fractionation followed by gas chromatography/olfactometry,
Flavour Fragr. J., 2006, 21, 2, 333-342, https://doi.org/10.1002/ffj.1621
. [all data]
Ibarz, Ferreira, et al., 2006
Ibarz, M.J.; Ferreira, V.; Hernández-Orte, P.; Loscos, N.; Cacho, J.,
Optimization and evaluation of a procedure for the gas chromatographic-mass spectrometric analysis of the aromas generated by fast acid hydrolysis of flavor precursors extracted from grapes,
J. Chromatogr. A, 2006, 1116, 1-2, 217-229, https://doi.org/10.1016/j.chroma.2006.03.020
. [all data]
Kishimoto, Wanikawa, et al., 2006
Kishimoto, T.; Wanikawa, A.; Kono, K.; Shibata, K.,
Comparison of the Odor-Active Compounds in Unhopped Beer and Beers Hopped with Different Hop Varieties,
J. Agric. Food Chem., 2006, 54, 23, 8855-8861, https://doi.org/10.1021/jf061342c
. [all data]
Komes, Ulrich, et al., 2006
Komes, D.; Ulrich, D.; Lovric, T.,
Characterization of odor-active compounds in Croatian Rhine Riesling wine, subregion Zagorje,
Eur. Food Res. Technol., 2006, 222, 1-2, 1-7, https://doi.org/10.1007/s00217-005-0094-y
. [all data]
Perestrelo, Fernandes, et al., 2006
Perestrelo, R.; Fernandes, A.; Albuquerque, F.F.; Marques, J.C.; Camara, J.S.,
Analytical characterization of the aroma of Tinta Negra Mole red wine: Identification of the main odorants compounds,
Anal. Chim. Acta., 2006, 563, 1-2, 154-164, https://doi.org/10.1016/j.aca.2005.10.023
. [all data]
Wierda R.L., Fletcher G., et al., 2006
Wierda R.L.; Fletcher G.; Xu L.; Dufour J.P.,
Analysis of volatile compounds as spoilage indicators in fresh king salmon (Oncorhynchus tshawytscha) during storage using SPME-GC-MS,
J. Agric. Food Chem., 2006, 54, 22, 8480-8490, https://doi.org/10.1021/jf061377c
. [all data]
Fan and Qian, 2005
Fan, W.; Qian, M.C.,
Headspace Solid Phase Microextraction and Gas Chromatography-Olfactometry Dilution Analysis of Young and Aged Chinese Yanghe Daqu Liquors,
J. Agric. Food Chem., 2005, 53, 20, 7931-7938, https://doi.org/10.1021/jf051011k
. [all data]
de la Fuente, Martinez-Castro, et al., 2005
de la Fuente, E.; Martinez-Castro, I.; Sanz, J.,
Characterization of Spanish unifloral honeys by solid phase microextraction and gas chromatography-mass spectrometry,
J. Sep. Sci., 2005, 28, 9-10, 1093-1100, https://doi.org/10.1002/jssc.200500018
. [all data]
Nogueira, Lubachevsky, et al., 2005
Nogueira, M.C.L.; Lubachevsky, G.; Rankin, S.A.,
A study of the volatile composition of Minas cheese,
Lebensm. Wiss. Technol., 2005, 38, 5, 555-563, https://doi.org/10.1016/j.lwt.2004.07.019
. [all data]
Qian and Wang, 2005
Qian, M.C.; Wang, Y.,
Seasonal Variations of Volatile Composition and Odor Activity Value of Marion (Rubus spp. hyb) and Thornless Evergreen (R.laciniatus L.) Blackberries,
J. Food. Sci., 2005, 70, 1, c13-c20, https://doi.org/10.1111/j.1365-2621.2005.tb09013.x
. [all data]
Wu, Krings, et al., 2005
Wu, S.; Krings, U.; Zorn, H.; Berger, R.G.,
Volatile compounds from the fruiting bodies of beefsteak fungus Fistulina hepatica (Schaeffer: Fr.) Fr.,
Food Chem., 2005, 92, 2, 221-226, https://doi.org/10.1016/j.foodchem.2004.07.013
. [all data]
Yao, Guo, et al., 2005
Yao, S.-S.; Guo, W.-F.; Lu, Y.; Jiang, Y.-X.,
Flavor Characteristics of Lapsang Souchong and Smoked Lapsang Souchong, a Special Chinese Black Tea with Pine Smoking Process,
J. Agric. Food Chem., 2005, 53, 22, 8688-8693, https://doi.org/10.1021/jf058059i
. [all data]
Culleré, Escudero, et al., 2004
Culleré, L.; Escudero, A.; Cacho, J.; Ferreira, V.,
Gas chromatography-olfactometry and chemical quantitative study of the aroma of six premium auality Spanish aged red wines,
J. Agric. Food Chem., 2004, 52, 6, 1653-1660, https://doi.org/10.1021/jf0350820
. [all data]
Jiang and Kubota, 2004
Jiang, L.; Kubota, K.,
Differences in the volatile components and their odor characteristics of green and ripe fruits and dried pericarp of Japanese pepper (Xanthoxylum piperitum DC.),
J. Agric. Food Chem., 2004, 52, 13, 4197-4203, https://doi.org/10.1021/jf030663a
. [all data]
López, Ezpeleta, et al., 2004
López, R.; Ezpeleta, E.; Sánchez, I.; Cacho, J.; Ferreira, V.,
Analysis of the aroma intensities of volatile compounds released from mild acid hydrolysates of odourless precursors extracted from Tempranillo and Grenache grapes using gas chromatography-olfactometry,
Food Chem., 2004, 88, 1, 95-103, https://doi.org/10.1016/j.foodchem.2004.01.025
. [all data]
Narain, Almeida, et al., 2004
Narain, N.; Almeida, J.N.; Galvão, M.S.; Madruga, M.S.; de Brito, E.S.,
Volatile compounds in passion fruit (Passiflora edulis forma Flavicarpa) and yellow mombin (Spondias mombin L.) fruits obtained by dynamic headspace technique,
Cienc. Tecnol. Aliment. Campinas, 2004, 24, 2, 212-216, https://doi.org/10.1590/S0101-20612004000200009
. [all data]
Soria, Gonzalez, et al., 2004
Soria, A.C.; Gonzalez, M.; de Lorenzo, C.; Martinez-Castro, I.; Sanza, J.,
Characterization of artisanal honeys from Madrid (Central Spain) on the basis of their melissopalynological, physicochemical and volatile composition data,
Food Chem., 2004, 85, 1, 121-130, https://doi.org/10.1016/j.foodchem.2003.06.012
. [all data]
Cros, Vandanjon, et al., 2003, 2
Cros, S.; Vandanjon, L.; Jaouen, P.; Bourseau, P.,
IMSTEC'03 Conference Proceedings, Processing of industrial mussel cooking juices by reverse osmosis: pollution abatement and aromas recovery, Universoty of New South Wales, Sydney, Australia, 2003, 6. [all data]
Dregus and Engel, 2003
Dregus, M.; Engel, K.-H.,
Volatile constituents of uncooked Rhubarb (Rheum rhabarbarum L.) stalks,
J. Agric. Food Chem., 2003, 51, 22, 6530-6536, https://doi.org/10.1021/jf030399l
. [all data]
Lee and Noble, 2003
Lee, S.-J.; Noble, A.C.,
Characterization of odor-active compounds in Californian Chardonnay wines using GC-olfactometry and GC-mass spectrometry,
J. Agric. Food Chem., 2003, 51, 27, 8036-8044, https://doi.org/10.1021/jf034747v
. [all data]
Lin, Cai, et al., 2003
Lin, P.; Cai, J.; Li, J.; Sang, W.; Su, Q.,
Constituents of the essential oil of Hemerocallis flava day lily,
Flavour Fragr. J., 2003, 18, 6, 539-541, https://doi.org/10.1002/ffj.1264
. [all data]
López, Ortín, et al., 2003
López, R.; Ortín, N.; Pérez-Trujillo, J.P.; Cacho, J.; Ferreira, V.,
Impact odorants of different young white wines from the Canary islands,
J. Agric. Food Chem., 2003, 51, 11, 3419-3425, https://doi.org/10.1021/jf026045w
. [all data]
Miyazawa and Okuno, 2003
Miyazawa, M.; Okuno, Y.,
Volatile components from the roots of Scrophularia ningpoensis Hemsl.,
Flavour Fragr. J., 2003, 18, 5, 398-400, https://doi.org/10.1002/ffj.1232
. [all data]
Tanaka, Yamauchi, et al., 2003
Tanaka, T.; Yamauchi, T.; Katsumata, R.; Kiuchi, K.,
Comparison of volatile components in commercial Itohiki-Natto by solid phase microextraction and gas chromatography,
Nippon Shokuhin Kagaku Kogaku Kaishi, 2003, 50, 6, 278-285, https://doi.org/10.3136/nskkk.50.278
. [all data]
Vichi, Castellote, et al., 2003
Vichi, S.; Castellote, A.I.; Pizzale, L.; Conte, L.S.; Buxaderas, S.; López-Tamames, E.,
Analysis of virgin olive oil volatile compounds by headspace solid-phase microextraction coupled to gas chromatography with mass spectrometric and flame ionization detection,
J. Chromatogr. A, 2003, 983, 1-2, 19-33, https://doi.org/10.1016/S0021-9673(02)01691-6
. [all data]
Vichi, Pizzale, et al., 2003
Vichi, S.; Pizzale, L.; Conte, L.S.; Buxaderas, S.; López-Tamames, E.,
Solid-phase microextraction in the analysis of virgin olive oil volatile fraction: modifications induced by oxidation and suitable markers of oxidative status,
J. Agric. Food Chem., 2003, 51, 22, 6564-6571, https://doi.org/10.1021/jf030268k
. [all data]
Vichi, Pizzale, et al., 2003, 2
Vichi, S.; Pizzale, L.; Conte, L.S.; Buxaderas, S.; López-Tamames, E.,
Solid-phase microextraction in the analysis of virgin olive oil volatile fraction: characterization of virgin olive oils from two distinct geographical areas of Northern Italy,
J. Agric. Food Chem., 2003, 51, 22, 6572-6577, https://doi.org/10.1021/jf030269c
. [all data]
Wanakhachornkrai and Lertsiri, 2003
Wanakhachornkrai, P.; Lertsiri, S.,
Analytical, nutritional, and clinical methods. Comparison of determination method for volatile compounds in Thai soy sauce,
Food Chem., 2003, 83, 4, 619-629, https://doi.org/10.1016/S0308-8146(03)00256-5
. [all data]
Czerny and Schieberle, 2002
Czerny, M.; Schieberle, P.,
Important aroma compounds in freshly ground wholemeal and white wheat flour-identification and quantitative changes during sourdough fermentation,
J. Agric. Food Chem., 2002, 50, 23, 6835-6840, https://doi.org/10.1021/jf020638p
. [all data]
Fu, Yoon, et al., 2002
Fu, S.-G.; Yoon, Y.; Basemore, R.,
Aroma-actie components in fermented bamboo shoots,
J. Agric. Food Chem., 2002, 50, 3, 549-554, https://doi.org/10.1021/jf010883t
. [all data]
Fukami, Ishiyama, et al., 2002
Fukami, K.; Ishiyama, S.; Yaguramaki, H.; Masuzawa, T.; Nabeta, Y.; Endo, K.; Shimoda, M.,
Identification of distinctive volatile compounds in fish sauce,
J. Agric. Food Chem., 2002, 50, 19, 5412-5416, https://doi.org/10.1021/jf020405y
. [all data]
Ito, Sugimoto, et al., 2002
Ito, Y.; Sugimoto, A.; Kakuda, T.; Kubota, K.,
Identification of potent odorants in Chinese jasmine green tea scented with flowers of Jasminum sambac,
J. Agric. Food Chem., 2002, 50, 17, 4878-4884, https://doi.org/10.1021/jf020282h
. [all data]
Qian and Reineccius, 2002
Qian, M.; Reineccius, G.,
Identification of aroma compounds in Parmigiano-Reggiano cheese by gas chromatography/olfactometry,
J. Dairy Sci., 2002, 85, 6, 1362-1369, https://doi.org/10.3168/jds.S0022-0302(02)74202-1
. [all data]
Suhardi, Suzuki, et al., 2002
Suhardi, S.; Suzuki, M.; Yoshida, K.; Muto, T.; Fujita, A.; Watanbe, N.,
Changes in the volatile compounds and in the chemical and physical properties of snake fruit (Salacca edulis Reinw) Cv. Pondoh during maturation,
J. Agric. Food Chem., 2002, 50, 26, 7627-7633, https://doi.org/10.1021/jf020620e
. [all data]
Ducruet, Fournier, et al., 2001
Ducruet, V.; Fournier, N.; Saillard, P.; Feigenbaum, A.; Guichard, E.,
Influence of packaging on the aroma stability of strawberry syrup during shelf life,
J. Agric. Food Chem., 2001, 49, 5, 2290-2297, https://doi.org/10.1021/jf0012796
. [all data]
Duque, Bonilla, et al., 2001
Duque, C.; Bonilla, A.; Bautista, E.; Zea, S.,
Exudation of low molecular wight compounds (thiobismethane, methyl isocyanide, amd methyl isothiocyanate) as a possible chemical defense mechanism in the marine sponge Ircinia felix,
Biochem. Systematics Ecol., 2001, 29, 5, 459-467, https://doi.org/10.1016/S0305-1978(00)00081-8
. [all data]
Miyazawa, Kurose, et al., 2001
Miyazawa, M.; Kurose, K.; Itoh, A.; Hiraoka, N.,
Comparison of the essential oils of Glehnia littoralis from Northern and Southern Japan,
J. Agric. Food Chem., 2001, 49, 11, 5433-5436, https://doi.org/10.1021/jf010219c
. [all data]
Weckerle, Bastl-Borrmann, et al., 2001
Weckerle, B.; Bastl-Borrmann, R.; Richling, E.; Hör, K.; Ruff, C.; Schreier, P.,
Cactus pear (Opuntia ficus indica) flavour constituents - chiral evaluation (MDGC-MS) and isotope ratio (HRGC-IRMS) analysis,
Flavour Fragr. J., 2001, 16, 5, 360-363, https://doi.org/10.1002/ffj.1012
. [all data]
Wei, Mura, et al., 2001
Wei, A.; Mura, K.; Shibamoto, T.,
Antioxidative activity of volatile chemicals extracted from beer,
J. Agric. Food Chem., 2001, 49, 8, 4097-4101, https://doi.org/10.1021/jf010325e
. [all data]
Buttery, Light, et al., 2000
Buttery, R.G.; Light, D.M.; Nam, Y.; Merrill, G.B.; Roitman, J.N.,
Volatile components of green walnut husks,
J. Agric. Food Chem., 2000, 48, 7, 2858-2861, https://doi.org/10.1021/jf000288b
. [all data]
Korány, Mednyánszky, et al., 2000
Korány, K.; Mednyánszky, Zs.; Amtmann, M.,
Preliminary results of a recognition method visualizing the aroma and fragrance features,
Acta Aliment., 2000, 29, 2, 187-198, https://doi.org/10.1556/AAlim.29.2000.2.9
. [all data]
Morales, Duque, et al., 2000
Morales, A.L.; Duque, C.; Bautista, E.,
Identification of free and glycosidically bound volatiles and glycosides by capillary GC and capillary GC-MS in Lulo del Chocó (Solanum topiro),
J. Hi. Res. Chromatogr., 2000, 23, 5, 379-385, https://doi.org/10.1002/(SICI)1521-4168(20000501)23:5<379::AID-JHRC379>3.0.CO;2-B
. [all data]
Parada, Duque, et al., 2000
Parada, F.; Duque, C.; Fujimoto, Y.,
Free and bound volatile composition and characterization of some glucoconjugates as aroma precursors in Melón de olor fruit pulp (Sicana odorifera),
J. Agric. Food Chem., 2000, 48, 12, 6200-6204, https://doi.org/10.1021/jf0007232
. [all data]
Buttery, Orts, et al., 1999
Buttery, R.G.; Orts, W.J.; Takeoka, G.R.; Nam, Y.,
Volatile flavor components of rice cakes,
J. Agric. Food Chem., 1999, 47, 10, 4353-4356, https://doi.org/10.1021/jf990140w
. [all data]
Chyau and Mau, 1999
Chyau, C.-C.; Mau, J.-L.,
Release of volatile compounds from microwave heating of garlic juice with 2,4-decadienals,
Food Chem., 1999, 64, 4, 531-535, https://doi.org/10.1016/S0308-8146(98)00162-9
. [all data]
Iwatsuki, Mizota, et al., 1999
Iwatsuki, K.; Mizota, Y.; Kubota, T.; Nishimura, O.; Masuda, H.; Sotoyama, K.; Tomita, M.,
Aroma extract dilution analysis. Evluation of aroma of pasteurized and UHT processed milk by aroma extract dilution analysis,
Nippon Shokuhin Kagaku Kogaku Kaishi, 1999, 46, 9, 587-597, https://doi.org/10.3136/nskkk.46.587
. [all data]
Kaya, Baser, et al., 1999
Kaya, A.; Baser, K.H.C.; Demirci, B.; Koca, F.,
The essential oil of Acinos alpinus (L.) Moench growing in Turkey,
Flavour Fragr. J., 1999, 14, 1, 55-59, https://doi.org/10.1002/(SICI)1099-1026(199901/02)14:1<55::AID-FFJ784>3.0.CO;2-Q
. [all data]
Kaya, Baser, et al., 1999, 2
Kaya, A.; Baser, K.H.C.; Tümen, G.; Koca, F.,
The essential oil of Acinos suaveolens (Sm.) G. Don fil. Acinos arvensis (Lam.) Dandy and Acinos rotundifolius Pers. growing wild in Turkey,
Flavour Fragr. J., 1999, 14, 1, 60-64, https://doi.org/10.1002/(SICI)1099-1026(199901/02)14:1<60::AID-FFJ785>3.0.CO;2-0
. [all data]
Kumazawa and Masuda, 1999
Kumazawa, K.; Masuda, H.,
Identification of potent odorants in Japanese green tea (Sen-cha),
J. Agric. Food Chem., 1999, 47, 12, 5169-5172, https://doi.org/10.1021/jf9906782
. [all data]
Suriyaphan, Drake, et al., 1999
Suriyaphan, O.; Drake, M.A.; Cadwallader, K.R.,
Identification of volatile off-flavors in reduced-fat cheddar cheeses containing lecitin,
Lebensm.-Wiss. u. Technol., 1999, 32, 5, 250-254, https://doi.org/10.1006/fstl.1999.0543
. [all data]
Umano, Nakahara, et al., 1999
Umano, K.; Nakahara, K.; Shoji, A.; Shibamoto, T.,
Aroma chemicals isolated and identified from leaves of aloe arborescens Mill. Var. natalensis Berger,
J. Agric. Food Chem., 1999, 47, 9, 3702-3705, https://doi.org/10.1021/jf990116i
. [all data]
Buttery and Ling, 1998
Buttery, R.G.; Ling, L.C.,
Additional studies on flavor components of corn tortilla chips,
J. Agric. Food Chem., 1998, 46, 7, 2764-2769, https://doi.org/10.1021/jf980125b
. [all data]
Campeanu, Burcea, et al., 1998
Campeanu, G.; Burcea, M.; Doneanu, C.; Namolosanu, I.; Visan, L.,
GC/MS characterization of the volatiles isolated from the wines obtained from the indigenous cultivar Feteasca Regala,
Analusis, 1998, 26, 2, 93-97, https://doi.org/10.1051/analusis:1998117
. [all data]
Parada and Duque, 1998
Parada, F.; Duque, C.,
Studies on the aroma of piñuela fruit pulp (Bromelia plumieri): Free and bound volatile composition and characterization of some glucoconjugates as aroma precursors,
J. Hi. Res. Chromatogr., 1998, 21, 10, 577-581, https://doi.org/10.1002/(SICI)1521-4168(19981001)21:10<577::AID-JHRC577>3.0.CO;2-V
. [all data]
Petersen, Poll, et al., 1998
Petersen, M.A.; Poll, L.; Larsen, L.M.,
Comparison of volatiles in raw and boiled potatoes using a mild extraction technique combined with GC odour profiling and GC-MS,
Food Chem., 1998, 61, 4, 461-466, https://doi.org/10.1016/S0308-8146(97)00119-2
. [all data]
Awano, Honda, et al., 1997
Awano, K.; Honda, T.; Ogawa, T.; Suzuki, S.; Matsunaga, Y.,
Volatile components of Phalaenopsis schilleriana Rehb. f.,
Flavour Fragr. J., 1997, 12, 5, 341-344, https://doi.org/10.1002/(SICI)1099-1026(199709/10)12:5<341::AID-FFJ657>3.0.CO;2-L
. [all data]
Chyau, Lin, et al., 1997
Chyau, C.-C.; Lin, Y.-C.; Mau, J.-L.,
Storage stability of deep-fried shallot flavoring,
J. Agric. Food Chem., 1997, 45, 8, 3211-3215, https://doi.org/10.1021/jf970109z
. [all data]
Sekiwa, Kubota, et al., 1997
Sekiwa, Y.; Kubota, K.; Kobayashi, A.,
Characteristic flavor components in the brew of cooked clam (Meretrix lusoria) and the effect of storage on flavor formation,
J. Agric. Food Chem., 1997, 45, 3, 826-830, https://doi.org/10.1021/jf960433e
. [all data]
Ulrich, Hoberg, et al., 1997
Ulrich, D.; Hoberg, E.; Rapp, A.; Kecke, S.,
Analysis of strawberry flavour - discrimination of aroma types by quantification of volatile compounds,
Z. Lebensm. Unters. Forsch. A, 1997, 205, 3, 218-223, https://doi.org/10.1007/s002170050154
. [all data]
Wada and Shibamoto, 1997
Wada, K.; Shibamoto, T.,
Isolation and identification of volatile compounds from a wine using solid phase extraction, gas chromatography, and gas chromatography/mass spectrometry,
J. Agric. Food Chem., 1997, 45, 11, 4362-4366, https://doi.org/10.1021/jf970157j
. [all data]
Kubota, Matsujage, et al., 1996
Kubota, K.; Matsujage, Y.; Sekiwa, Y.; Kobayashi, A.,
Identification of the characteristic volatile flavor compounds formed by cooking squid (Todarodes pacificus Steenstrup),
Food Sci. Technol., 1996, 2, 3, 163-166. [all data]
Morales, Albarracín, et al., 1996
Morales, A.L.; Albarracín, D.; Rodríguez, J.; Duque, C.; Riaño, L.E.; Espitia, J.,
Volatile constituents from Andes berry (Rubus glaucus Benth),
J. Hi. Res. Chromatogr., 1996, 19, 10, 585-587, https://doi.org/10.1002/jhrc.1240191011
. [all data]
Shuichi, Masazumi, et al., 1996
Shuichi, H.; Masazumi, N.; Hiromu, K.; Kiyoshi, F.,
Comparison of volatile compounds berween the crude drugs, Onji-tsutsu and Onji-niki,
Nippon nogei kagaku kaishi, 1996, 70, 2, 151-160. [all data]
Wong and Lai, 1996
Wong, K.C.; Lai, F.Y.,
Volatile constituents from the fruits of four Syzygium species grown in Malaysia,
Flavour Fragr. J., 1996, 11, 1, 61-66, https://doi.org/10.1002/(SICI)1099-1026(199601)11:1<61::AID-FFJ539>3.0.CO;2-1
. [all data]
Christensen and Reineccius, 1995
Christensen, K.R.; Reineccius, G.A.,
Aroma extract dilution analysis of aged cheddar cheese,
J. Food Sci., 1995, 60, 2, 218-220, https://doi.org/10.1111/j.1365-2621.1995.tb05641.x
. [all data]
Girard and Lau, 1995
Girard, B.; Lau, O.L.,
Effect of maturity and storage on quality and volatile production of 'Jonagold' apples,
Food Res. Int., 1995, 28, 5, 465-471, https://doi.org/10.1016/0963-9969(96)81393-7
. [all data]
Kawakami, Ganguly, et al., 1995
Kawakami, M.; Ganguly, S.N.; Banerjee, J.; Kobayashi, A.,
Aroma composition of oolong tea and black tea by brewed extraction method and characterizing compounds of Darjeeling tea aroma,
J. Agric. Food Chem., 1995, 43, 1, 200-207, https://doi.org/10.1021/jf00049a037
. [all data]
Kobayashi, Tsuda, et al., 1995
Kobayashi, A.; Tsuda, Y.; Hirata, N.; Kubota, K.; Kitamura, K.,
Aroma constituents of soybean [Glycine max (L.) Merril] milk lacking lipoxygenase isozymes,
J. Agric. Food Chem., 1995, 43, 9, 2449-2452, https://doi.org/10.1021/jf00057a025
. [all data]
Togari, Kobayashi, et al., 1995
Togari, N.; Kobayashi, A.; Aishima, T.,
Pattern recognition applied to gas chromatographic profiles of volatile components in three tea categories,
Food Res. Int., 1995, 28, 5, 495-502, https://doi.org/10.1016/0963-9969(95)00029-1
. [all data]
Chung, Eiserich, et al., 1993
Chung, T.Y.; Eiserich, J.P.; Shibamoto, T.,
Volatile compounds identified in headspace samples of peanut oil heated under temperatures ranging from 50 to 200 °C,
J. Agric. Food Chem., 1993, 41, 9, 1467-1470, https://doi.org/10.1021/jf00033a022
. [all data]
Kawakami, Kobayashi, et al., 1993
Kawakami, M.; Kobayashi, A.; Kator, K.,
Volatile constituents of Rooibos tea (Aspalathus linearis) as affected by extraction process,
J. Agric. Food Chem., 1993, 41, 4, 633-636, https://doi.org/10.1021/jf00028a023
. [all data]
Shimoda, Shiratsuchi, et al., 1993
Shimoda, M.; Shiratsuchi, H.; Minegishi, Y.; Osajima, Y.,
Flavor deterioration of nonfermented coarse-cut sausage during storage. Flavor as a factor of quality for nonfermented sausage. 2,
J. Agric. Food Chem., 1993, 41, 6, 946-950, https://doi.org/10.1021/jf00030a021
. [all data]
Chyau, Chen, et al., 1992
Chyau, C.-C.; Chen, S.-Y.; Wu, C.-M.,
Differences of volatile and nonvolatile constituents between mature and ripe guave (Psidium guajava Linn) fruits,
J. Agric. Food Chem., 1992, 40, 5, 846-849, https://doi.org/10.1021/jf00017a028
. [all data]
Hatsuko, Kazuko, et al., 1992
Hatsuko, S.; Kazuko, H.; Masayoshi, K.; Yoshiaki, I.,
Improvement of quality of likorine extract by heat treatment,
J. Food Sci. Technol., 1992, 39, 11, 976-983, https://doi.org/10.3136/nskkk1962.39.976
. [all data]
Miranda-López, Libbey, et al., 1992
Miranda-López, R.; Libbey, L.M.; Watson, B.T.; McDaniel, M.R.,
Research note. Identificatiohn of additional odor-active compounds in Pinot noir wines,
Am. J. Enol. Vitic, 1992, 43, 1, 90-92. [all data]
Kawakami and Kobayashi, 1991
Kawakami, M.; Kobayashi, A.,
Volatitle constituents of greem mate and roasted mate,
J. Agric. Food Chem., 1991, 39, 7, 1275-1279, https://doi.org/10.1021/jf00007a016
. [all data]
De Llano D.G., Ramos M., et al., 1990
De Llano D.G.; Ramos M.; Polo C.; Sanz J.; Martinez-Castro I.,
Evolution of the volatile components of an artisanal blue cheese during ripening,
J. Dairy Sci., 1990, 73, 7, 1676-1683, https://doi.org/10.3168/jds.S0022-0302(90)78842-X
. [all data]
Hsieh, Williams, et al., 1989
Hsieh, T.C.Y.; Williams, S.S.; Vejaphan, W.; Meyers, S.P.,
Characterization of Volatile Components of Menhaden Fish (Brevoortia tyrannus) Oil,
J. Amer. Oil Chem. Soc., 1989, 66, 1, 114-117, https://doi.org/10.1007/BF02661797
. [all data]
Andersen J.F., Mikolajczak K.L., et al., 1987
Andersen J.F.; Mikolajczak K.L.; Reed D.K.,
Analysis of peach bark volatiles and their electroantennogram activity with lesser pechtree borer, Synanthedon pictipes (Grote and Robinson),
J. Chem. Ecol., 1987, 13, 11, 2103-2114, https://doi.org/10.1007/BF01012874
. [all data]
Buttery, Ling, et al., 1983
Buttery, R.G.; Ling, L.C.; Teranishi, R.; Mon, T.R.,
Insect attractants: volatiles of hydrolizyed protein insect baits,
J. Agric. Food Chem., 1983, 31, 4, 689-692, https://doi.org/10.1021/jf00118a003
. [all data]
Buttery, Parker, et al., 1981
Buttery, R.G.; Parker, F.D.; Teranishi, R.; Mon, T.R.; Ling, L.C.,
Volatile components of alfalfa leaf-cutter bee cells,
J. Agric. Food Chem., 1981, 29, 5, 955-958, https://doi.org/10.1021/jf00107a017
. [all data]
Delabre and Bendall, 9999
Delabre, M.-L.; Bendall, J.F.,
Flavour ingredients from fermented dairy streams,
Expression of Multidisciplinary Flavour Sci., 9999, 375-378. [all data]
Gyawali and Kim, 2012
Gyawali, R.; Kim, K.-S.,
Bioactive volatile compounds of three medicinal plants from Nepal,
Kathmandu Univ. J. Sci., Engineering and Technol., 2012, 8, 1, 51-62. [all data]
Lee, Chong, et al., 2012
Lee, P.-R.; Chong, I.S.-M.; Yu, B.; Curran, P.; Liu, S.-Q.,
Effect of precursors on volatile compounds in Papaya wine fermented by mixed yeasts,
Uncorrected proof, 2012, 000-000. [all data]
Welke, Manfroi, et al., 2012
Welke, J.E.; Manfroi, V.; Zanus, M.; Lazarotto, M.; Zini, C.A.,
Characterization of the volatile profile of Brazilian merlot wines through comprehensive two dimensional gas chromatography time-of-flight mass spectrometric detection,
J. Chromatogr. A, 2012, 1226, 124-139, https://doi.org/10.1016/j.chroma.2012.01.002
. [all data]
Johanningsmeier and McFeeters, 2011
Johanningsmeier, S.D.; McFeeters, R.F.,
Detection of volatile spoilage metabolites in fermented cucumbers using nontargeted, comprehensive 2-dimensional gas chromatography-time-of-flight mass spectrometry (GCxGCxTOFMS),
J. Food Sci., 2011, 76, 1, c168-c177, https://doi.org/10.1111/j.1750-3841.2010.01918.x
. [all data]
Povolo, Cabassi, et al., 2011
Povolo, M.; Cabassi, G.; Profaizer, M.; Lanteri, S.,
Study on the use of evolved gas analysis FT-IR (EGA FT-IR) for the evaluation of cheese volatile fraction,
The Open Food Sci. J., 2011, 5, 1, 10-16, https://doi.org/10.2174/1874256401105010010
. [all data]
Sampaio, Garruti, et al., 2011
Sampaio, K.S.; Garruti, D.S.; Franco, M.R.B.; Janzantti, N.S.; Da Silva, M.A.AP.,
Aroma volatiles recovered in the water phase of cashew apple (Anacardium occidentale L.) juice during concentration,
J. Sci. Food Agric., 2011, 91, 10, 1801-1809, https://doi.org/10.1002/jsfa.4385
. [all data]
Xiao, Dai, et al., 2011
Xiao, Z.; Dai, S.; Niu, Y.; Yu, H.; Zhu, J.; Tian, H.; Gu, Y.,
Discrimination of Chinese vinegars based on headspace solid-phase microextraction - gas chromatography mass spectrometry of volatile compounds and multivariate analysis,
J. Food Sci., 2011, 76, 8, c1125-c1135, https://doi.org/10.1111/j.1750-3841.2011.02356.x
. [all data]
Chinnici, Guerrero, et al., 2009
Chinnici, F.; Guerrero, E.D.; Sonni, F.; Natali, N.; Marin, R.N.; Riponi, C.,
Gas chromatography - mass spectrometry (GC-MS) characterization of volatile compounds in quality vinegars with protected Europian geographical indication,
J. Agric. Food Chem., 2009, 57, 11, 4784-4792, https://doi.org/10.1021/jf804005w
. [all data]
Harraca, Syed, et al., 2009
Harraca, V.; Syed, Z.; Guerin, P.M.,
Olfactory and behavioural responces of tsetse flies, Glossina spp., to rumen metabolites,
J. Comp. Physiol. A, 2009, 195, 9, 815-824, https://doi.org/10.1007/s00359-009-0459-y
. [all data]
Li, Tao, et al., 2008
Li, H.; Tao, Y.-S.; Wang, H.; Zhang, L.,
Impact odorants of Chardonnay dry white wine from Changli Counti (China),
Eur. Food. Res. Technol., 2008, 227, 1, 287-292, https://doi.org/10.1007/s00217-007-0722-9
. [all data]
Tao, Wenlai, et al., 2008
Tao, L.; Wenlai, F.; Yan, X.,
Characterization of volatile and semi-volatile compounds in Chinese rica wines by headspace solid phase microextraction followed by gas chromatography - mass spectrometry,
J. Inst. Brew., 2008, 114, 2, 172-179, https://doi.org/10.1002/j.2050-0416.2008.tb00323.x
. [all data]
Yongsheng, Hua, et al., 2008
Yongsheng, T.; Hua, L.; Hua, W.; Li, Z.,
Volatile composition of young Cabernet Savignon red wine from Changli Counti (China),
J. Food Composition and Analysis, 2008, 21, 8, 689-694, https://doi.org/10.1016/j.jfca.2008.05.007
. [all data]
Zhang, Zhang, et al., 2008
Zhang, C.; Zhang, H.; Wang, L.; Guo, X.,
Effect of carrot (Daucus carota) antifreeze proteins on texture preperties of frozen dough and volatile compounds of crumb,
Food. Sci. Technol. (Lebesmittel-Wissenschaft und Technologie), 2008, 41, 6, 1029-1036, https://doi.org/10.1016/j.lwt.2007.07.010
. [all data]
Li, Tao, et al., 2007
Li, H.; Tao, Y.-S.; Wang, H.; Zhang, L.,
Impact odorants of Chardonnay dry white wine from Changli County (China),
Eur. Food Res. Technol., 2007, https://doi.org/10.1007/s00217-007-0722-9
. [all data]
Selli, 2007
Selli, S.,
Volatile constituents of orange obtained from moro oranges (Citrus Sinensis L. Osbeck),
J. Food Quality, 2007, 30, 3, 330-341, https://doi.org/10.1111/j.1745-4557.2007.00124.x
. [all data]
Weldegergis B.T., Tredoux A.G.J., et al., 2007
Weldegergis B.T.; Tredoux A.G.J.; Crouch A.M.,
Application of a headspace sorptive extraction method for the analysis of volatile components in South African wines,
J. Agric. Food Chem., 2007, 55, 21, 8696-8702, https://doi.org/10.1021/jf071554p
. [all data]
Zhang C., Zhang H., et al., 2007
Zhang C.; Zhang H.; Wang L.; Gao H.; Guo X.N.; Yao H.Y.,
Improvement of texture properties and flavor of frozen dough by carrot (Daucus carota) antifreeze protein supplementation,
J. Agric. Food Chem., 2007, 55, 23, 9620-9626, https://doi.org/10.1021/jf0717034
. [all data]
Krings, Zelena, et al., 2006
Krings, U.; Zelena, K.; Wu, S.; Berger, R.G.,
Thin-layer high-vacuum distillation to isolate volatile flavour compounds of cocoa powder,
Eur. Food Res. Technol., 2006, 223, 5, 675-681, https://doi.org/10.1007/s00217-006-0252-x
. [all data]
Quijano and Pino, 2006
Quijano, C.E.; Pino, J.A.,
Changes in volatile constituents during the ripening of cocona (Solanum sessiliflorum Dunal) fruit,
Revista CENIC Ciencias Quimicas, 2006, 37, 3, 133-136. [all data]
Riu-Aumatell, Bosch-Fuste´, et al., 2006
Riu-Aumatell, M.; Bosch-Fuste´, J.; Lopez-Tamames, E.; Buxaderas, S.,
Development of volatile compounds of cava (Spanish sparkling wine) during long ageing time in contact with lees,
Food Chem., 2006, 95, 2, 237-242, https://doi.org/10.1016/j.foodchem.2005.01.029
. [all data]
Editorial paper, 2005
Editorial paper,
Solid Phase Microextraction (SPME) Application Guide,
The Reporter Europe (Supelco), 2005, 16, 5, 12-12. [all data]
Steinhaus and Schieberle, 2005
Steinhaus, M.; Schieberle, P.,
Characterization of odorants causing an atypical aroma in white pepper powder (Piper nigrum L.) based on quantitative measurements and orthonasal breakthrough thresholds,
J. Agric. Food Chem., 2005, 53, 15, 6049-6055, https://doi.org/10.1021/jf0506030
. [all data]
Baser, Özek, et al., 2004
Baser, K.H.C.; Özek, T.; Kirimer, N.; Deliorman, D.; Ergun, F.,
Composition of the essential oils of Galium aparine L. and Galium odoratum (L.) Scop. from Turkey,
J. Essent. Oil Res., 2004, 16, 4, 305-307, https://doi.org/10.1080/10412905.2004.9698728
. [all data]
Didzbalis, Ritter, et al., 2004
Didzbalis, J.; Ritter, K.A.; Trail, A.C.; Plog, F.J.,
Identification of fruity/fermented odorants in high-temperature-cured roasted peanuts,
J. Agric. Food Chem., 2004, 52, 15, 4828-4833, https://doi.org/10.1021/jf0355250
. [all data]
Salinas, Zalacain, et al., 2004
Salinas, M.; Zalacain, A.; Pardo, F.; Alonso, G.L.,
Stir bar sorptive extraction applied to volatile constituents evolution during Vitis vinifera ripening,
J. Agric. Food Chem., 2004, 52, 15, 4821-4827, https://doi.org/10.1021/jf040040c
. [all data]
Selli, Cabaroglu, et al., 2003
Selli, s.; Cabaroglu, T.; Canbas, A.,
Flavour components of orange wine made from a Turkish cv. Kozan,
Int. J. Food Sci. Technol., 2003, 38, 5, 587-593, https://doi.org/10.1046/j.1365-2621.2003.00691.x
. [all data]
Escalona, Birkmyre, et al., 2002
Escalona, H.; Birkmyre, L.; Piggott, J.R.; Paterson, A.,
Effect of maturation in small oak casks on the volatility of red wine aroma compounds,
Anal. Chim. Acta., 2002, 458, 1, 45-54, https://doi.org/10.1016/S0003-2670(01)01538-0
. [all data]
Rogerson and de Freitas, 2002
Rogerson, F.S.S.; de Freitas, V.A.P.,
Fortification spirit, a contributor to the aroma complexity of port,
J. Food Sci., 2002, 67, 4, 1564-1569, https://doi.org/10.1111/j.1365-2621.2002.tb10323.x
. [all data]
Torrens, 2002
Torrens, J.,
El análisis del aroma aplicado al control de calidad del cava [CS2002 Análisis sensorial (vino)], 2002, retrieved from http://www.percepnet.com/documenta/CS0203.pdf. [all data]
Escalona, Birkmyre, et al., 2001
Escalona, H.; Birkmyre, L.; Piggott, J.R.; Paterson, A.,
Relationship between sensory perception volatile and phenolic components in commercial Spanish red wines from different regions,
J. Inst. Brew., 2001, 107, 3, 157-166, https://doi.org/10.1002/j.2050-0416.2001.tb00087.x
. [all data]
López and Dufour, 2001
López, M.G.; Dufour, J.P.,
Chapter 6. Tequilas: charm analysis of Blanco, Teposado, and Anejo tequilas,
Am. Chem. Soc. Symp. Ser., 2001, 782, 62-72. [all data]
Mayorga, Knapp, et al., 2001
Mayorga, H.; Knapp, H.; Winterhalter, P.; Duque, C.,
Glycosidically bound flavor compounds of cape gooseberry (Physalis peruviana L.),
J. Agric. Food Chem., 2001, 49, 4, 1904-1908, https://doi.org/10.1021/jf0011743
. [all data]
Miranda, Nogueira, et al., 2001
Miranda, E.J.F.; Nogueira, R.I.; Pontes, S.M.; Rezende, C.M.,
Odour-active compounds of banana passa identified by aroma extract dilution analysis,
Flavour Fragr. J., 2001, 16, 4, 281-285, https://doi.org/10.1002/ffj.997
. [all data]
Saglam, Gozler, et al., 2001
Saglam, H.; Gozler, T.; Kivcak, B.; Demirci, B.; Baser, K.H.C.,
Volatile compounds from Haplophyllum myrtifolium,
Chem. Nat. Compd. (Engl. Transl.), 2001, 37, 5, 442-444, https://doi.org/10.1023/A:1014467225815
. [all data]
Lambert, Demazeau, et al., 1999
Lambert, Y.; Demazeau, G.; Largeteau, A.; Bouvier, J.-M.,
Changes in aromatic volatile composition of strawberry after high pressure treatment,
Food Chem., 1999, 67, 1, 7-16, https://doi.org/10.1016/S0308-8146(99)00084-9
. [all data]
Vas, Gal, et al., 1998
Vas, G.; Gal, L.; Harangi, J.; Dobo, A.; Vekey, K.,
Determination of volatile aroma compounds of Blaeufrankisch wines extracted by solid-phase microextraction,
J. Chromatogr. Sci., 1998, 36, 10, 505-510, https://doi.org/10.1093/chromsci/36.10.505
. [all data]
Zehentbauer and Grosch, 1998
Zehentbauer, G.; Grosch, W.,
Crust aroma of baguettes. I. Key odorants of baguettes prepared in two different ways,
J. Cereal Science, 1998, 28, 1, 81-92, https://doi.org/10.1006/jcrs.1998.0184
. [all data]
Ziegleder, 1998
Ziegleder, G.,
Volatile and odorous compounds in unprinted paperboard,
Packag. Technol. Sci., 1998, 11, 5, 231-239, https://doi.org/10.1002/(SICI)1099-1522(1998090)11:5<231::AID-PTS437>3.0.CO;2-A
. [all data]
Guth, 1997
Guth, H.,
Identification of character impact odorants of different white wine varieties,
J. Agric. Food Chem., 1997, 45, 8, 3022-3026, https://doi.org/10.1021/jf9608433
. [all data]
Lizárraga-Guerra, Guth, et al., 1997
Lizárraga-Guerra, R.; Guth, H.; López, M.G.,
Identification of the most potent odorants in huitlacoche (Ustilago maydis) and austern pilzen (Pleurotus sp.) by aroma extract dilution analysis and static head-space samples,
J. Agric. Food Chem., 1997, 45, 4, 1329-1332, https://doi.org/10.1021/jf960650f
. [all data]
López-Tamames, Carro-Mariño, et al., 1997
López-Tamames, E.; Carro-Mariño, N.; Gunata, Y.Z.; Sapis, C.; Baumes, R.; Bayonove, C.,
Potential aroma in several varieties of Spanish grapes,
J. Agric. Food Chem., 1997, 45, 5, 1729-1735, https://doi.org/10.1021/jf960572w
. [all data]
Carro Marino, López Tamames, et al., 1995
Carro Marino, N.; López Tamames, E.; García Jares, C.M.,
Contribution to the study of the aromatic potential of three muscat Vitis vinifera varieties: identification of new compounds,
Food Sci. Technol. Int., 1995, 1, 2-3, 105-116, https://doi.org/10.1177/108201329500100206
. [all data]
Miranda-Lopez, Libbey, et al., 1992
Miranda-Lopez, R.; Libbey, L.M.; Watson, B.T.; McDaniel, M.R.,
Odor analysis of Pinot noir wines from grapes of different maturities by a gas chromatography-olfactometry technique (Osme),
J. Food Sci., 1992, 57, 4, 985-993, https://doi.org/10.1111/j.1365-2621.1992.tb14339.x
. [all data]
Peng, Yang, et al., 1991, 2
Peng, C.T.; Yang, Z.C.; Ding, S.F.,
Prediction of rentention idexes. II. Structure-retention index relationship on polar columns,
J. Chromatogr., 1991, 586, 1, 85-112, https://doi.org/10.1016/0021-9673(91)80028-F
. [all data]
Peppard and Ramus, 1988
Peppard, T.L.; Ramus, S.A.,
Use of Kovats' gas chromatographic retention indices in beer flavor studies,
Am. Soc. Brew. Chem. Proc., 1988, 46, 2, 26-30. [all data]
Donnelly, Abdel-Hamid, et al., 1993
Donnelly, J.R.; Abdel-Hamid, M.S.; Jeter, J.L.; Gurka, D.F.,
Application of gas chromatographic retention properties to the identification of environmental contaminants,
J. Chromatogr., 1993, 642, 1-2, 409-415, https://doi.org/10.1016/0021-9673(93)80106-I
. [all data]