[1,2]Azaborino[1,2-a][1,2]azaborine
- Formula: C8H8BN
- Molecular weight: 128.967
- IUPAC Standard InChIKey: GSVAFVMURLKGLG-UHFFFAOYSA-N
- CAS Registry Number: 1425-58-7
- Chemical structure:

Gas phase ion energetics data

Data compiled by: Henry M. Rosenstock, Keith Draxl, Bruce W. Steiner, and John T. Herron
Ionization energy determinations
IE (eV) | Method | Reference |
---|---|---|
8.24 | PE | Dewar and Worley, 1969 |

References

Dewar and Worley, 1969
Dewar, M.J.S.; Worley, S.D.,
Photoelectron spectra of molecules. I. Ionization potentials of some organic molecules and their interpretation,
J. Chem. Phys., 1969, 50, 654. [all data]