Bicyclo[3.2.1]octan-3-one
- Formula: C8H12O
- Molecular weight: 124.1803
- IUPAC Standard InChIKey: HIMMOVPGAJKVOS-UHFFFAOYSA-N
- CAS Registry Number: 14252-05-2
- Chemical structure:
View 3d structure (requires JavaScript / HTML 5) - Other names: 3-Bicyclo[3.2.1]octanone

Gas phase thermochemistry data

Data compiled by: Hussein Y. Afeefy, Joel F. Liebman, and Stephen E. Stein
Quantity | Value | Units | Method | Reference | Comment |
---|---|---|---|---|---|
ΔfH°gas | -221. ± 8.4 | kJ/mol | Ccb | Steele, 1979 |

Gas phase ion energetics data

Data compiled by: Sharon G. Lias, John E. Bartmess, Joel F. Liebman, John L. Holmes, Rhoda D. Levin, and W. Gary Mallard
Ionization energy determinations
IE (eV) | Method | Reference | Comment |
---|---|---|---|
9.23 | PE | Spanka and Rademacher, 1986 | Vertical value |

References

Steele, 1979
Steele, W.V.,
Thermochemically determined ΔH°f(g) values for ketones and alcohols,
Private Communication, University of Stirling, Stirling, Scotland, 1979, 0. [all data]
Spanka and Rademacher, 1986
Spanka, G.; Rademacher, P.,
Transannular interactions in difunctional medium rings. 1. n/π Interactions in cyclic amino ketones and aminoalkenes studied by photoelectron spectroscopy,
J. Org. Chem., 1986, 51, 592. [all data]