Pyridine,4-bromo-,1-oxide
- Formula: C5H4BrNO
- Molecular weight: 173.995
- IUPAC Standard InChIKey: ZRXLKDCFWJECNO-UHFFFAOYSA-N
- CAS Registry Number: 14248-50-1
- Chemical structure:
View 3d structure (requires JavaScript / HTML 5) - Permanent link for this species. Use this link for bookmarking this species for future reference.

Gas phase ion energetics data

Data compiled by: Sharon G. Lias, Rhoda D. Levin, and Sherif A. Kafafi
Ionization energy determinations
IE (eV) | Method | Reference | Comment |
---|---|---|---|
8.44 | PE | Weiner and Lattman, 1974 | Vertical value |

References

Weiner and Lattman, 1974
Weiner, M.A.; Lattman, M.,
Photoelectron spectra of 4-substituted pyridine N-oxides,
Tetrahedron Lett., 1974, 1709. [all data]