pentafluoronitrosobenzene
- Formula: C6F5NO
- Molecular weight: 197.0623
- CAS Registry Number: 1423-13-8

Gas phase ion energetics data

Data compiled by: Sharon G. Lias and Joel F. Liebman
Ionization energy determinations
IE (eV) | Method | Reference | Comment |
---|---|---|---|
9.53 | PE | Furin, Zibarev, et al., 1989 | Vertical value |

Gas phase thermochemistry data

Data compiled by: Hussein Y. Afeefy, Joel F. Liebman, and Stephen E. Stein
Quantity | Value | Units | Method | Reference | Comment |
---|---|---|---|---|---|
ΔfH°gas | -160. ± 2. | kcal/mol | Kin | Choo, Golden, et al., 1975 |

References

Furin, Zibarev, et al., 1989
Furin, G.G.; Zibarev, A.V.; Sultanov, A.Sh.; Furlei, I.I.,
Order and structure of the outer valence Mo's of some derivatives of pentafluorobenzene,
Bull. Acad. Sci. USSR, Div. Chem. Sci., 1989, 4, 772. [all data]
(editor), 1980
(editor), Koptyug V.A.,
Atlas of Spectra of Aromatic and Heterocyclic Compounds, 1980, 18, 32. [all data]