1,2-Ethanediamine, N,N,N'-trimethyl-
- Formula: C5H14N2
- Molecular weight: 102.1781
- IUPAC Standard InChIKey: HVOYZOQVDYHUPF-UHFFFAOYSA-N
- CAS Registry Number: 142-25-6
- Chemical structure:
View 3d structure (requires JavaScript / HTML 5) - Other names: Ethylenediamine, N,N,N'-trimethyl-; N,N,N'-Trimethyl-1,2-ethanediamine; N,N,N'-Trimethyldiaminoethane; N,N,N'-Trimethylethanediamine; N,N,N'-Trimethylethylenediamine; 2-(Dimethylamino)-N-methylethylamine; 1,2-Diaminoethane, N,N,N'-trimethyl-; dimethyl(2-(methylamino)ethyl)amine

Phase change data

Data compiled by: Robert L. Brown and Stephen E. Stein
Quantity | Value | Units | Method | Reference | Comment |
---|---|---|---|---|---|
Tboil | 390.2 | K | N/A | Aldrich Chemical Company Inc., 1990 |

Gas phase ion energetics data

Data compiled by: Sharon G. Lias, John E. Bartmess, Joel F. Liebman, John L. Holmes, Rhoda D. Levin, and W. Gary Mallard
Appearance energy determinations
Ion | AE (eV) | Other Products | Method | Reference | Comment |
---|---|---|---|---|---|
C3H8N+ | 8.32 | C2H6N | EI | Burkey, Castelhano, et al., 1983 |

References

Aldrich Chemical Company Inc., 1990
Aldrich Chemical Company Inc.,
Catalog Handbook of Fine Chemicals, Aldrich Chemical Company, Inc., Milwaukee WI, 1990, 1. [all data]
Burkey, Castelhano, et al., 1983
Burkey, T.J.; Castelhano, A.L.; Griller, D.; Lossing, F.P.,
Heats of formation and ionization potentials of some α-aminoalkyl radicals,
J. Am. Chem. Soc., 1983, 105, 4701. [all data]