Tricyclo[3.2.1.02,4]octan-8-one,(1α,2α,4α,5α)-
- Formula: C8H10O
- Molecular weight: 122.1644
- IUPAC Standard InChIKey: PSZPCAFRANQPLS-HYNHDVCUSA-N
- CAS Registry Number: 14224-86-3
- Chemical structure:
View 3d structure (requires JavaScript / HTML 5) - Species with the same structure:
- Stereoisomers:

Gas phase ion energetics data

Data compiled by: Henry M. Rosenstock, Keith Draxl, Bruce W. Steiner, and John T. Herron
Ionization energy determinations
IE (eV) | Method | Reference |
---|---|---|
8.8 ± 0.1 | EI | Brion, Farmer, et al., 1970 |

References

Brion, Farmer, et al., 1970
Brion, C.E.; Farmer, J.S.H.; Pincock, R.E.; Stewart, W.B.,
Mass spectra of some geometric isomers at 1216 Å and 584 Å : The photoionization of isomeric tricyclo[3.2.1.02,4]octanes and related compounds,
Org. Mass Spectrom., 1970, 4, 587. [all data]