1-butanol, 3,3-dimethyl-, acetate
- Formula: C8H16O2
- Molecular weight: 144.2114
- IUPAC Standard InChIKey: AVXZMWDBEBBNOE-UHFFFAOYSA-N
- CAS Registry Number: 1421-87-0
- Chemical structure:
View 3d structure (requires JavaScript / HTML 5) - Permanent link for this species. Use this link for bookmarking this species for future reference.

Phase change data

Data compiled by: Thermodynamics Research Center, NIST Boulder Laboratories, Chris Muzny director
Quantity | Value | Units | Method | Reference | Comment |
---|---|---|---|---|---|
Tfus | 199.6 | K | N/A | Anonymous, 1957 | Uncertainty assigned by TRC = 0.6 K |

References

Anonymous, 1957
Anonymous, R.,
, Am. Pet. Inst. Res. Proj. 6, Carnegie-Mellon Univ., 1957. [all data]