Benzeneacetonitrile, 4-hydroxy-
- Formula: C8H7NO
- Molecular weight: 133.1473
- IUPAC Standard InChIKey: AYKYOOPFBCOXSL-UHFFFAOYSA-N
- CAS Registry Number: 14191-95-8
- Chemical structure:
View 3d structure (requires JavaScript / HTML 5) - Other names: Acetonitrile, (p-hydroxyphenyl)-; (4-Hydroxyphenyl)acetonitrile; p-Hydroxybenzyl cyanide; p-Hydroxyphenylacetonitrile; 4-Hydroxybenzyl cyanide; 4-Hydroxyphenylacetic acid nitrile

Phase change data

Data compiled by: Robert L. Brown and Stephen E. Stein
Quantity | Value | Units | Method | Reference | Comment |
---|---|---|---|---|---|
Tboil | 603.2 | K | N/A | Weast and Grasselli, 1989 |
Reduced pressure boiling point
Tboil (K) | Pressure (bar) | Reference |
---|---|---|
603.2 | 1.01 | Aldrich Chemical Company Inc., 1990 |

Gas phase ion energetics data

Data compiled by: Henry M. Rosenstock, Keith Draxl, Bruce W. Steiner, and John T. Herron
Ionization energy determinations
IE (eV) | Method | Reference |
---|---|---|
9.01 ± 0.05 | EI | Buchs, 1970 |

References

Weast and Grasselli, 1989
CRC Handbook of Data on Organic Compounds, 2nd Editon, Weast,R.C and Grasselli, J.G., ed(s)., CRC Press, Inc., Boca Raton, FL, 1989, 1. [all data]
Aldrich Chemical Company Inc., 1990
Aldrich Chemical Company Inc.,
Catalog Handbook of Fine Chemicals, Aldrich Chemical Company, Inc., Milwaukee WI, 1990, 1. [all data]
Buchs, 1970
Buchs, A.,
Etude par spectrometrie de masse de l'ionisation de benzonitriles, de phenylacetonitriles et de N,N-dimethylanilines substitues,
Helv. Chim. Acta, 1970, 53, 2026. [all data]