2-Thiouracil
- Formula: C4H4N2OS
- Molecular weight: 128.152
- IUPAC Standard InChIKey: ZEMGGZBWXRYJHK-UHFFFAOYSA-N
- CAS Registry Number: 141-90-2
- Chemical structure:
View 3d structure (requires JavaScript / HTML 5) - Other names: 4(1H)-Pyrimidinone, 2,3-dihydro-2-thioxo-; Uracil, 2-thio-; Antagothyroil; Deracil; Nobilen; Thiouracil; 2-Mercapto-4-hydroxypyrimidine; 2-Mercapto-4-pyrimidinol; 6-Hydroxy-2-mercaptopyrimidine; 4-Hydroxy-2-mercaptopyrimidine; Antagothyroid; TU; 2-Mercapto-4-pyrimidone; 2-Mercaptopyrimid-4-one; 2-Thio-1,3-pyrimidin-4-one; 2-TU; 2,3-Dihydro-2-thioxo-4(1H)-pyrimidinone; 4-Hydroxy-2-pyrimidinethiol; 4-Pyrimidinol, 2-mercapto-; 6-Thiouracil; NSC 19473

Gas phase ion energetics data

Data compiled by: Sharon G. Lias and Joel F. Liebman
Ionization energy determinations
IE (eV) | Method | Reference |
---|---|---|
8.80 | PE | Katritzky and Szafrani, 1990 |

References

Katritzky and Szafrani, 1990
Katritzky, A.R.; Szafrani, M.,
The tautomeric equilibria of thio analogues of nucleic acid bases. Part 3. Ultraviolet photoelectron spectra of 2-thiouracil and its methyl derivatives,
J. Chem. Soc. Perkin Trans. 2, 1990, 871. [all data]