3-Penten-2-one, 4-methyl-
- Formula: C6H10O
- Molecular weight: 98.1430
- IUPAC Standard InChIKey: SHOJXDKTYKFBRD-UHFFFAOYSA-N
- CAS Registry Number: 141-79-7
- Chemical structure:
View 3d structure (requires JavaScript / HTML 5) - Other names: Acetone, isopropylidene-; Isobutenyl methyl ketone; Isopropylideneacetone; Mesityl oxide; Methyl isobutenyl ketone; Methyl 2-methyl-1-propenyl ketone; 4-Methyl-3-penten-2-one; (CH3)2C=CHC(=O)CH3; Methyl 2,2-dimethylvinyl ketone; 4-Methyl-3-pentene-2-one; 2-Methylpent-2-en-4-one; 2-Methyl-2-penten-4-one; Mesityloxid; Mesityloxyde; MIBK; Ossido di mesitile; Oxyde de mesityle; 3-Isohexen-2-one; 4-Methyl-3-penten-2-on; 4-Methylpent-3-en-2-one; 4-Metil-3-penten-2-one; 2-Methyl-2-pentenone-4; UN 1229; 2-Methyl-4-oxo-2-pentene; 2,2-Dimethylvinyl methyl ketone; NSC 38717; 4-methyl-3-penten-2-one (mesityl oxide)

Gas phase thermochemistry data

Data compiled by: Hussein Y. Afeefy, Joel F. Liebman, and Stephen E. Stein
Quantity | Value | Units | Method | Reference | Comment |
---|---|---|---|---|---|
ΔfH°gas | -178.28 ± 0.64 | kJ/mol | Ccb | Steele, Chirico, et al., 1997 | |
ΔfH°gas | -184.5 ± 2.5 | kJ/mol | Eqk | Guthrie, 1978 |

Condensed phase thermochemistry data

Data compiled by: Hussein Y. Afeefy, Joel F. Liebman, and Stephen E. Stein
Quantity | Value | Units | Method | Reference | Comment |
---|---|---|---|---|---|
ΔfH°liquid | -220.98 ± 0.58 | kJ/mol | Ccb | Steele, Chirico, et al., 1997 | |
ΔfH°liquid | -219. ± 0.8 | kJ/mol | Ccb | Lebedeva, Gutner, et al., 1976 | |
Quantity | Value | Units | Method | Reference | Comment |
ΔcH°liquid | -3569.23 ± 0.48 | kJ/mol | Ccb | Steele, Chirico, et al., 1997 | Corresponding ΔfHºliquid = -220.98 kJ/mol (simple calculation by NIST; no Washburn corrections) |
ΔcH°liquid | -3571. ± 0.8 | kJ/mol | Ccb | Lebedeva, Gutner, et al., 1976 | Corresponding ΔfHºliquid = -219. kJ/mol (simple calculation by NIST; no Washburn corrections) |
ΔcH°liquid | -3540. | kJ/mol | Ccb | Guinchant, 1918 | Corresponding ΔfHºliquid = -250. kJ/mol (simple calculation by NIST; no Washburn corrections) |
ΔcH°liquid | -3549. | kJ/mol | Ccb | Roth-Greifswald, 1911 | Heat of combustion corrected for pressure; Corresponding ΔfHºliquid = -241. kJ/mol (simple calculation by NIST; no Washburn corrections) |

Phase change data

Data compiled as indicated in comments:
BS - Robert L. Brown and Stephen E. Stein
TRC - Thermodynamics Research Center, NIST Boulder Laboratories, Chris Muzny director
ALS - Hussein Y. Afeefy, Joel F. Liebman, and Stephen E. Stein
AC - William E. Acree, Jr., James S. Chickos
Quantity | Value | Units | Method | Reference | Comment |
---|---|---|---|---|---|
Tboil | 402. ± 1. | K | AVG | N/A | Average of 8 values; Individual data points |
Quantity | Value | Units | Method | Reference | Comment |
Tfus | 220.3 | K | N/A | Stross, Monger, et al., 1947 | Uncertainty assigned by TRC = 0.3 K; TRC |
Quantity | Value | Units | Method | Reference | Comment |
Tc | 605. | K | N/A | Steele, Chirico, et al., 1997, 2 | Uncertainty assigned by TRC = 2. K; TRC |
Quantity | Value | Units | Method | Reference | Comment |
Pc | 40.00 | bar | N/A | Steele, Chirico, et al., 1997, 2 | Uncertainty assigned by TRC = 1.50 bar; derived from fit of obs. vapor pressure; TRC |
Quantity | Value | Units | Method | Reference | Comment |
ρc | 2.830 | mol/l | N/A | Steele, Chirico, et al., 1997, 2 | Uncertainty assigned by TRC = 0.10 mol/l; TRC |
Quantity | Value | Units | Method | Reference | Comment |
ΔvapH° | 42.70 ± 0.28 | kJ/mol | V | Steele, Chirico, et al., 1997 | ALS |
ΔvapH° | 42.7 ± 0.3 | kJ/mol | EB | Steele, Chirico, et al., 1997, 3 | Based on data from 303. to 442. K.; AC |
ΔvapH° | 44.8 | kJ/mol | CGC | Chickos, Hosseini, et al., 1995 | Based on data from 343. to 383. K.; AC |
ΔvapH° | 43.3 | kJ/mol | N/A | Messerly, Finke, et al., 1975 | Based on data from 292. to 471. K.; AC |
Enthalpy of vaporization
ΔvapH (kJ/mol) | Temperature (K) | Method | Reference | Comment |
---|---|---|---|---|
41.4 ± 0.3 | 320. | EB | Steele, Chirico, et al., 1997, 3 | Based on data from 303. to 442. K.; AC |
39.1 ± 0.3 | 360. | EB | Steele, Chirico, et al., 1997, 3 | Based on data from 303. to 442. K.; AC |
36.5 ± 0.3 | 400. | EB | Steele, Chirico, et al., 1997, 3 | Based on data from 303. to 442. K.; AC |
33.5 ± 0.6 | 440. | EB | Steele, Chirico, et al., 1997, 3 | Based on data from 303. to 442. K.; AC |
37.8 | 414. | A | Stephenson and Malanowski, 1987 | Based on data from 399. to 471. K.; AC |
41.5 | 328. | MM | Stephenson and Malanowski, 1987 | Based on data from 313. to 405. K. See also Stross, Monger, et al., 1947, 2 and Dykyj, 1972.; AC |
35.2 | 401. | N/A | Louguinine, 1898 | May be a mixture of 2-methyl-1-penten-4-one and 4-methyl-3-penten-2-one; AC |
Antoine Equation Parameters
log10(P) = A − (B / (T + C))
P = vapor pressure (bar)
T = temperature (K)
View plot Requires a JavaScript / HTML 5 canvas capable browser.
Temperature (K) | A | B | C | Reference | Comment |
---|---|---|---|---|---|
287. to 403.1 | 4.19353 | 1434.631 | -60.088 | Fuge, Bowden, et al., 1952 | Coefficents calculated by NIST from author's data. |
Enthalpy of fusion
ΔfusH (kJ/mol) | Temperature (K) | Reference | Comment |
---|---|---|---|
12.1 | 229.6 | Borgen, Borgen, et al., 1975 | AC |

Gas phase ion energetics data

Data evaluated as indicated in comments:
HL - Edward P. Hunter and Sharon G. Lias
L - Sharon G. Lias
Data compiled as indicated in comments:
LLK - Sharon G. Lias, Rhoda D. Levin, and Sherif A. Kafafi
RDSH - Henry M. Rosenstock, Keith Draxl, Bruce W. Steiner, and John T. Herron
LBLHLM - Sharon G. Lias, John E. Bartmess, Joel F. Liebman, John L. Holmes, Rhoda D. Levin, and W. Gary Mallard
Quantity | Value | Units | Method | Reference | Comment |
---|---|---|---|---|---|
IE (evaluated) | 9.10 ± 0.02 | eV | N/A | N/A | L |
Quantity | Value | Units | Method | Reference | Comment |
Proton affinity (review) | 878.7 | kJ/mol | N/A | Hunter and Lias, 1998 | HL |
Quantity | Value | Units | Method | Reference | Comment |
Gas basicity | 846.9 | kJ/mol | N/A | Hunter and Lias, 1998 | HL |
Ionization energy determinations
IE (eV) | Method | Reference | Comment |
---|---|---|---|
9.11 | PE | Masclet and Mouvier, 1978 | LLK |
9.08 ± 0.03 | PI | Watanabe, Nakayama, et al., 1962 | RDSH |
8.89 ± 0.05 | EI | Omura, Higasi, et al., 1956 | RDSH |
Appearance energy determinations
Ion | AE (eV) | Other Products | Method | Reference | Comment |
---|---|---|---|---|---|
C5H7O+ | 9.48 | CH3 | EI | Alai, Attardo, et al., 1985 | LBLHLM |

Kovats' RI, non-polar column, temperature ramp

Data compiled by: NIST Mass Spectrometry Data Center, William E. Wallace, director

Column type Capillary
Active phase OV-101
Column length (m) 70.
Carrier gas N2
Substrate
Column diameter (mm) 0.28
Phase thickness (μm)
Tstart (C) 80.
Tend (C) 200.
Heat rate (K/min) 2.
Initial hold (min)
Final hold (min)
I 782.
ReferenceYamaguchi and Shibamoto, 1981
Comment MSDC-RI

Kovats' RI, non-polar column, isothermal

View large format table.

Column type Active phase Temperature (C) I Reference Comment
PackedApiezon L120.771.Bogoslovsky, Anvaer, et al., 1978Celite 545

Kovats' RI, polar column, temperature ramp

View large format table.

Column type Active phase I Reference Comment
CapillaryCarbowax 20M1118.Tressl, Friese, et al., 1978He, 2. K/min; Column length: 50. m; Column diameter: 0.28 mm; Tstart: 70. C; Tend: 190. C

Van Den Dool and Kratz RI, non-polar column, temperature ramp

View large format table.

Column type Active phase I Reference Comment
CapillaryHP-1778.Zhang, Dorjpalam, et al., 199250. m/0.32 mm/1.5 μm, 2. K/min, 220. C @ 30. min; Tstart: 40. C

Van Den Dool and Kratz RI, polar column, temperature ramp

View large format table.

Column type Active phase I Reference Comment
CapillaryZB-Wax1118.Ledauphin, Saint-Clair, et al., 200430. m/0.25 mm/0.15 μm, He, 35. C @ 5. min, 5. K/min, 220. C @ 10. min
CapillaryFFAP1159.Stephan and Steinhart, 199960. m/0.25 mm/0.5 μm, 50. C @ 3. min, 5. K/min, 230. C @ 15. min
CapillaryDB-Wax1131.Shimoda, Shigematsu, et al., 199560. m/0.25 mm/0.25 μm, 2. K/min; Tstart: 50. C; Tend: 230. C
CapillaryCP-WAX 57CB1136.Salter L.J., Mottram D.S., et al., 198860. C @ 5. min, 4. K/min; Column length: 50. m; Column diameter: 0.32 mm; Tend: 200. C

Van Den Dool and Kratz RI, polar column, custom temperature program

View large format table.

Column type Active phase I Reference Comment
CapillaryDB-Wax1125.Cantergiani, Brevard, et al., 200130. m/0.25 mm/0.25 μm; Program: 20C(30s) => fast => 60C => 4C/min => 220C (20min)

Normal alkane RI, non-polar column, isothermal

View large format table.

Column type Active phase Temperature (C) I Reference Comment
PackedDC-400150.792.Anderson, 1968Helium, Gas-Pak (60-80 mesh); Column length: 3.0 m

Normal alkane RI, non-polar column, temperature ramp

View large format table.

Column type Active phase I Reference Comment
CapillaryHP-5 MS798.Lazarevic, Radulovic, et al., 201030. m/0.25 mm/0.25 μm, Helium, 5. K/min; Tstart: 70. C; Tend: 290. C
CapillaryHP-5801.1Leffingwell and Alford, 200560. m/0.32 mm/0.25 μm, He, 30. C @ 2. min, 2. K/min, 260. C @ 28. min
CapillaryHP-5778.N/A30. m/0.32 mm/0.25 μm, Helium, 40. C @ 2. min, 5. K/min, 250. C @ 5. min
CapillaryDB-5792.Tellez, Khan, et al., 200230. m/0.25 mm/0.25 μm, He, 3. K/min; Tstart: 60. C; Tend: 240. C
CapillaryDB-5800.Tellez, Canel, et al., 199930. m/0.25 mm/0.25 μm, He, 3. K/min; Tstart: 60. C; Tend: 240. C
CapillaryDB-1780.Tai and Ho, 199860. m/0.32 mm/1.0 μm, He, 2. K/min; Tstart: 40. C; Tend: 280. C
CapillaryOV-101787.Zenkevich and Kulikova, 1993He, 3. K/min; Column length: 54. m; Column diameter: 0.26 mm; Tstart: 50. C; Tend: 230. C

Normal alkane RI, non-polar column, custom temperature program

View large format table.

Column type Active phase I Reference Comment
CapillaryHP-5798.Zhao, Li, et al., 200830. m/0.25 mm/0.25 μm; Program: 40 0C (2 min) 5 0C/min -> 80 0C 7 oC/min -> 160 0C 9 0C/min -> 200 0C 20 0C/min -> 280 0C (10 min)
CapillaryHP-5804.Zhao, Li, et al., 200830. m/0.25 mm/0.25 μm; Program: not specified
CapillaryDB-5 MS782.Zhu, Li, et al., 200830. m/0.25 mm/0.25 μm, Helium; Program: 50 0C (2.8 min) 5.5 0C/min -> 140 0C (1 min) 4.5 oC/min -> 220 0C -> 225 0C (2 min) 3.4 0C/min -> 265 0C (5 min)
CapillaryDB-5 MS797.Zhu, Li, et al., 200830. m/0.25 mm/0.25 μm, Helium; Program: 50 0C (2.8 min) 5.5 0C/min -> 140 0C (1 min) 4.5 oC/min -> 220 0C -> 225 0C (2 min) 3.4 0C/min -> 265 0C (5 min)
CapillaryRTX-5798.Ádámová, Orinák, et al., 200530. m/0.25 mm/0.25 μm, N2; Program: not specified
CapillaryRTX-5798.Ádámová, Orinák, et al., 200530. m/0.25 mm/0.25 μm, N2; Program: not specified
CapillaryRTX-5 MS802.Machiels and Istasse, 200360. m/0.25 mm/0.5 μm, He; Program: 35C (3min) => 10C/min => 50C => 4C/min => 200C => 50C/min => 250C (10min)
CapillaryBPX-5798.Machiels, van Ruth, et al., 200360. m/0.32 mm/1. μm, He; Program: 40C (4min) => 2C/min => 90C => 4C/min => 130C => 8C/min => 250 C (10min)
CapillaryBPX-5798.Machiels, van Ruth, et al., 200360. m/0.32 mm/1. μm, He; Program: 40C (4min) => 2C/min => 90C => 4C/min => 130C => 8C/min => 250 C (10min)
CapillaryMethyl Silicone783.Zenkevich, 1999Program: not specified
CapillaryHP-5804.Timón, Ventanas, et al., 199850. m/0.32 mm/0.52 μm, He; Program: 35 0C 10 0C/min -> 200 0C (20 min) 5 0C/min -> 230 0C (50 min)
CapillaryPolydimethyl siloxanes783.Zenkevich, 1997Program: not specified

Normal alkane RI, polar column, temperature ramp

View large format table.

Column type Active phase I Reference Comment
CapillaryZB-Wax1114.N/A30. m/0.32 mm/0.25 μm, Helium, 40. C @ 2. min, 5. K/min, 250. C @ 5. min
CapillaryRTX-Wax1152.Galindo-Cuspinera, Lubran, et al., 200260. m/0.25 mm/0.5 μm, He, 40. C @ 5. min, 5. K/min, 180. C @ 20. min
CapillaryDB-Wax1129.Werkhoff, Güntert, et al., 199860. m/0.32 mm/0.25 μm, H2, 3. K/min; Tstart: 60. C; Tend: 220. C
CapillaryDB-Wax1113.Pollak and Berger, 199630. m/0.32 mm/0.5 μm, He, 40. C @ 1. min, 3. K/min, 210. C @ 25. min
CapillaryCarbowax 20M1110.Kawakami, Ganguly, et al., 199560. C @ 4. min, 2. K/min; Column length: 60. m; Column diameter: 0.25 mm; Tend: 180. C
CapillaryCarbowax 20M1110.Kawakami and Kobayashi, 1991He, 60. C @ 4. min, 2. K/min; Column length: 50. m; Column diameter: 0.25 mm; Tend: 180. C
CapillaryDB-Wax1127.Takeoka, Flath, et al., 198860. m/0.25 mm/0.25 μm, H2, 30. C @ 2. min, 2. K/min; Tend: 180. C
CapillaryDB-Wax1127.Takeoka, Flath, et al., 198860. m/0.25 mm/0.25 μm, H2, 30. C @ 2. min, 2. K/min; Tend: 180. C

Normal alkane RI, polar column, custom temperature program

View large format table.

Column type Active phase I Reference Comment
CapillarySOLGel-Wax1140.Johanningsmeier and McFeeters, 201130. m/0.25 mm/0.25 μm, Helium; Program: 40 0C (2 min) 5 0C/min -> 140 0C 10 0C/min -> 250 0C (3 min)
CapillarySOLGel-Wax1131.Johanningsmeier and McFeeters, 201130. m/0.25 mm/0.25 μm, Helium; Program: not specified
CapillaryCP-Wax 52 CB1111.Kaack and Christensen, 200850. m/0.25 mm/0.29 μm, Helium; Program: 33 0C (1 min) 2 0C/min -> 130 0C 10 0C/min -> 220 0C
CapillaryHP-Innowax1127.Narain, Galvao, et al., 200730. m/0.25 mm/0.25 μm, He; Program: 30C(5min) => 7C/min => 100C(5min) => 1C/min => 130C => 10C/min => 195C(45min)
CapillaryHP-Innowax1128.Narain, Galvao, et al., 200730. m/0.25 mm/0.25 μm, He; Program: 30C(5min) => 7C/min => 100C(5min) => 1C/min => 130C => 10C/min => 195C(45min)
CapillarySupelcowax 101125.Castioni and Kapetanidis, 199660. m/0.25 mm/0.25 μm, Helium; Program: 60 0C (10 min) 2 0C/min -> 80 0C 3 0C/min -> 100 0C 4 0C/min -> 220 0C (30 min)
CapillarySupelcowax 101137.Castioni and Kapetanidis, 199660. m/0.25 mm/0.25 μm, Helium; Program: not specified

References

Steele, Chirico, et al., 1997
Steele, W.V.; Chirico, R.D.; Cowell, A.B.; Knipmeyer, S.E.; Nguyen, A.,
Thermodynamic properties and ideal-gas enthalpies of formation for 2-aminoisobutyric acid (2-methylalanine), acetic acid, (4-methyl-3-penten-2-one), 4-methylpent-1-ene, 2,2'-bis(phenylthio)propane, and glycidyl phenyl ether (1,2-epoxy-3-phenoxypropane),
J. Chem. Eng. Data, 1997, 42, 1052-1066. [all data]
Guthrie, 1978
Guthrie, J.P.,
Equilibrium constants for a series of simple aldol condensations, and linear free energy relations with other carbonyl addition reactions,
Can. J. Chem., 1978, 56, 962-973. [all data]
Lebedeva, Gutner, et al., 1976
Lebedeva, N.D.; Gutner, N.M.; Kiseleva, N.N.,
Correlation of the departures from additivity in the enthalpies of formation of ethylene and benzene derivatives with the σp constants,
J. Org. Chem. USSR (Engl. Transl.), 1976, 12, 1594-1597. [all data]
Guinchant, 1918
Guinchant, M.J.,
Etude sur la fonction acide dans les derives metheniques et methiniques,
Ann. Chem., 1918, 10, 30-84. [all data]
Roth-Greifswald, 1911
Roth-Greifswald, W.A.,
XVIII. Hauptversammlung der Deutschen Bunsen-Gesellschaft fur angewandte physikalische Chemie,
Z. Electrochem., 1911, 17, 789-840. [all data]
Stross, Monger, et al., 1947
Stross, F.H.; Monger, J.M.; Finch, H. deV.,
Isolation and Purification of the Two Isomers of Mesityl Oxide,
J. Am. Chem. Soc., 1947, 69, 1627-8. [all data]
Steele, Chirico, et al., 1997, 2
Steele, W.V.; Chirico, R.D.; Cowell, A.B.; Knipmeyer, S.E.; Nguyen, A.,
Thermodynamic Properties and Ideal-Gas Enthalpies of FOrmation for 2-Aminoisobutyric Acid (2-Methylalanine), Acetic Acid, (Z)-5-Ethylidene-2- norbornene, Mesityl Oxide (4-Methyl-3-pentene-2-one), 4-M,
J. Chem. Eng. Data, 1997, 42, 1053-66. [all data]
Steele, Chirico, et al., 1997, 3
Steele, W.V.; Chirico, R.D.; Cowell, A.B.; Knipmeyer, S.E.; Nguyen, A.,
Thermodynamic Properties and Ideal-Gas Enthalpies of Formation for 2-Aminoisobutyric Acid (2-Methylalanine), Acetic Acid, ( Z )-5-Ethylidene-2-norbornene, Mesityl Oxide (4-Methyl-3-penten-2-one), 4-Methylpent-1-ene, 2,2'-Bis(phenylthio)propane, and Glycidyl Phenyl Ether (1,2-Epoxy-3-phenoxypropane),
J. Chem. Eng. Data, 1997, 42, 6, 1053-1066, https://doi.org/10.1021/je970099y
. [all data]
Chickos, Hosseini, et al., 1995
Chickos, James S.; Hosseini, Sarah; Hesse, Donald G.,
Determination of vaporization enthalpies of simple organic molecules by correlations of changes in gas chromatographic net retention times,
Thermochimica Acta, 1995, 249, 41-62, https://doi.org/10.1016/0040-6031(95)90670-3
. [all data]
Messerly, Finke, et al., 1975
Messerly, J.F.; Finke, H.L.; Osborn, A.G.; Douslin, D.R.,
Low-temperature calorimetric and vapor-pressure studies on alkanediamines,
J. Chem. Thermodynam., 1975, 7, 1029-1046. [all data]
Stephenson and Malanowski, 1987
Stephenson, Richard M.; Malanowski, Stanislaw,
Handbook of the Thermodynamics of Organic Compounds, 1987, https://doi.org/10.1007/978-94-009-3173-2
. [all data]
Stross, Monger, et al., 1947, 2
Stross, F.H.; Monger, J.M.; Finch, H. de V.,
The Isolation and Purification of Two Isomers of Mesityl Oxide,
J. Am. Chem. Soc., 1947, 69, 7, 1627-1628, https://doi.org/10.1021/ja01199a016
. [all data]
Dykyj, 1972
Dykyj, J.,
Petrochemia, 1972, 12, 1, 13. [all data]
Louguinine, 1898
Louguinine, W.,
Ann. Chim. (Paris), 1898, 7, 334. [all data]
Fuge, Bowden, et al., 1952
Fuge, E.T.J.; Bowden, S.T.; Jones, W.J.,
Some Physical Properties of Diacetone Alcohol, Mesityl Oxide and Methyl Isobutyl Ketone,
J. Phys. Chem., 1952, 56, 8, 1013-1016, https://doi.org/10.1021/j150500a022
. [all data]
Borgen, Borgen, et al., 1975
Borgen, Gerd; Borgen, Gerd; Dale, Johannes; Gaupset, Gudmund; Schroll, G.; Altona, C.,
Syntheses and Conformations of Monomeric and Dimeric Cyclic Dimethylketals.,
Acta Chem. Scand., 1975, 29b, 265-272, https://doi.org/10.3891/acta.chem.scand.29b-0265
. [all data]
Hunter and Lias, 1998
Hunter, E.P.; Lias, S.G.,
Evaluated Gas Phase Basicities and Proton Affinities of Molecules: An Update,
J. Phys. Chem. Ref. Data, 1998, 27, 3, 413-656, https://doi.org/10.1063/1.556018
. [all data]
Masclet and Mouvier, 1978
Masclet, P.; Mouvier, G.,
Etude par spectrometrie photoelectronique d'aldehydes et de cetones ethyleniques conjugues,
J. Electron Spectrosc. Relat. Phenom., 1978, 14, 77. [all data]
Watanabe, Nakayama, et al., 1962
Watanabe, K.; Nakayama, T.; Mottl, J.,
Ionization potentials of some molecules,
J. Quant. Spectry. Radiative Transfer, 1962, 2, 369. [all data]
Omura, Higasi, et al., 1956
Omura, I.; Higasi, K.; Baba, H.,
Ionization potentials of some organic molecules. II. Aliphatic compounds,
Bull. Chem. Soc. Japan, 1956, 29, 504. [all data]
Alai, Attardo, et al., 1985
Alai, M.; Attardo, G.G.; Rye, R.T.B.,
Formation threshold structures of some [C5H7O]+ ions: Use of general schemes for estimation of heats of formation of gas phase ions,
Can. J. Chem., 1985, 63, 833. [all data]
Timmons, 1966
Timmons, C.J.,
UV atlas of organic compounds, 1966, 1, B 3/2. [all data]